program: Gaussian 09
title: 000233983
version: EM64L-G09RevD.01
frameworkgroup: C1[X(C8H14Cl2N2O2)]
method: RPBEPBE
basis: SDD
operation: Freq
keyword: #p
keyword: freq=noraman
keyword: PBEPBE/SDD
title: #p freq=noraman PBEPBE/SDD
converged: YES YES NO NO
title: Mulliken charges:
elementType: Cl Cl O O N N C C C C C C C C H H H H H H H H H H H H H H
charge: -0.078751 -0.078752 -0.283609 -0.283602 -0.366794 -0.366807 -0.535145 -0.535183 0.266261 0.266287 -0.328025 -0.328052 -0.557506 -0.557509 0.287658 0.222658 0.287738 0.222618 0.266116 0.245399 0.245390 0.266116 0.312538 0.312535 0.268878 0.280328 0.268875 0.280340
chargesum: 0.00000
title: Mulliken charges with hydrogens summed into heavy atoms:
elementType: Cl Cl O O N N C C C C C C C C
charge: -0.078751 -0.078752 -0.283609 -0.283602 -0.054256 -0.054272 -0.024829 -0.024827 0.266261 0.266287 0.183490 0.183453 -0.008300 -0.008294
polarizability: 1.69342677e+02 -9.26462233e+00 1.17367640e+02 -4.84389342e-03 -7.02869747e-03 9.12496204e+01
1716.lowfreq: -11.9302 -6.1245 -0.0029 -0.0025 0.0008 4.2800 7.5044 24.1014 33.8100
frequency: 6.7584 23.7596 33.7958 35.5305 48.7320 59.5600 73.1050 124.3280 129.3046 133.0563 182.8688 237.9018 240.9897 294.7716 310.4219 371.4099 418.3257 451.6406 499.2786 570.0523 576.8432 591.3443 601.0394 611.9035 621.5579 655.0265 704.2281 808.1605 809.3418 837.4016 917.8338 924.0761 981.1852 986.4551 1014.6391 1020.2449 1031.0321 1068.0652 1113.6419 1119.7472 1153.2103 1164.9733 1172.1487 1205.5120 1216.2751 1231.3856 1240.1124 1248.4952 1295.0077 1296.7203 1326.7418 1356.5722 1365.1012 1368.2203 1441.4163 1441.4429 1444.5537 1448.1859 1448.9394 1455.6605 1487.7018 1491.1238 1611.0263 1618.0656 2980.6638 2987.0324 2993.8988 2993.9599 3034.2799 3051.3624 3051.3889 3056.0387 3066.7309 3066.7832 3154.6933 3154.7219 3540.7821 3540.9011
redmass: 11.1252 6.6454 3.6665 5.3050 11.7121 7.3769 3.9450 3.8495 3.3629 2.8142 5.7159 7.5707 6.8132 2.6329 2.1444 3.3290 2.9818 2.7576 2.9638 2.4818 3.2425 3.8955 4.0800 1.4796 1.2467 3.4626 2.8516 1.7542 2.1000 2.0385 2.6437 2.9707 2.3230 2.4287 2.0778 1.8262 1.6482 3.1380 3.4695 2.3345 1.3037 1.2790 1.3098 1.4930 1.4090 1.3308 1.5228 1.2479 1.1714 1.1787 1.3940 1.4591 1.3750 1.5942 1.1036 1.1038 1.0814 1.1075 1.0900 1.0990 1.9554 2.0012 6.5657 6.0489 1.0607 1.0595 1.0591 1.0590 1.0985 1.0977 1.0977 1.1012 1.0617 1.0617 1.1120 1.1120 1.0777 1.0776
irintensity: 0.0119 0.0522 3.5171 5.8839 0.4309 11.5661 4.8203 21.1638 4.1672 2.7806 4.2420 24.4121 2.0127 4.7091 26.8010 1.4438 16.9930 3.4629 8.6668 30.5023 7.6978 29.0593 48.6177 61.7629 115.1933 19.6175 0.1569 15.5534 22.8692 3.0146 10.4327 2.0402 23.2667 14.2960 30.7375 3.1065 5.3318 0.0001 6.3116 1.7979 0.0838 24.8807 0.0264 26.6931 0.0242 258.6990 8.4723 99.5193 33.3183 12.3153 56.0315 0.7903 7.1890 7.1334 3.8211 12.4050 0.1774 96.9537 1.1011 28.8635 529.6434 17.0994 217.8603 79.0770 5.2154 69.7699 57.2311 12.9447 12.5690 0.9959 10.6853 21.7354 16.2984 29.2537 22.9932 4.4887 50.4701 10.4538
temp: 298.150 k
press: 1.00000 atm
elementType: 17 17 8 8 7 7 6 6 6 6 6 6 6 6 1 1 1 1 1 1 1 1 1 1 1 1 1 1
symmnumber: 1
zpe: 582827.7 jmol-1
zpe.correction: 0.221987 hartree
zpe.thermalcorrener: 0.238439 hartree
zpe.thermalcorrenthalpy: 0.239383 hartree
zpe.thermalcorrgfe: 0.171728 hartree
zpe.sumelectzpe: -1492.251279 hartree
zpe.sumelectthermal: -1492.234828 hartree
zpe.sumelectthermalent: -1492.233884 hartree
zpe.sumelectthermalfe: -1492.301538 hartree
dipole: 0.0012 -0.0005 -1.5332
dipole: 1.5332
quadrupole: -92.9390 -106.5224 -96.0668
quadrupole: 14.3599 0.0044 0.0042
quadrupole: 5.5704 -8.0130 2.4426 14.3599 0.0044 0.0042
hfenergy: -1492.4732665 hartree
pointgroup: C01 [X(C8H14Cl2N2O2)]
dipole: -0.0003818 -0.6032092 -0.0007503 debye
polarizability: 166.3310815|0.0006252|91.2496506|15.27388|-0.029112|120.3792056 unknown
InChI: InChI=1S/C8H14Cl2N2O2/c9-3-5-11-7(13)1-2-8(14)12-6-4-10/h11-12H,1-6H2
charge 0 multiplicity 1
28 atoms
Cl -5.792451 -0.508222 -1.724125
Cl 5.791107 -0.509753 1.724542
O  -1.788229 0.599371 1.560091
O  1.789091 0.60284 -1.559809
N  -3.074876 -0.559396 0.007925
N  3.075009 -0.559777 -0.009947
C  -0.654204 -0.362491 -0.406219
C  0.654199 -0.363764 0.40367
C  -1.867036 -0.068568 0.481622
C  1.867229 -0.068676 -0.483517
C  -4.346899 -0.294459 0.685557
C  4.347412 -0.292513 -0.68595
C  -5.324844 0.499709 -0.178432
C  5.323992 0.500773 0.1804
H  -0.569477 0.437115 -1.169608
H  -0.787071 -1.312277 -0.957327
H  0.569888 0.434208 1.168817
H  0.786505 -1.314833 0.952691
H  -4.100927 0.2967 1.588989
H  -4.819637 -1.240441 1.011022
H  4.821173 -1.237501 -1.01281
H  4.101763 0.300171 -1.588471
H  -3.103985 -1.075719 -0.874191
H  3.103756 -1.077862 0.871146
H  -6.277112 0.686059 0.339484
H  -4.887944 1.431973 -0.563788
H  6.276548 0.68889 -0.336348
H  4.886018 1.431941 0.567185
