program: Gaussian 09
title: 000233981
version: EM64L-G09RevD.01
frameworkgroup: C1[X(C10H18Cl2N2O2)]
method: RPBEPBE
basis: SDD
operation: Freq
keyword: #p
keyword: freq=noraman
keyword: PBEPBE/SDD
title: #p freq=noraman PBEPBE/SDD
converged: YES YES NO NO
title: Mulliken charges:
elementType: Cl Cl O O N N C C C C C C C C C C H H H H H H H H H H H H H H H H H H
charge: -0.081827 -0.082190 -0.272991 -0.272630 -0.365327 -0.364969 -0.350612 -0.349768 -0.556304 -0.556570 0.246182 0.245521 -0.332472 -0.334009 -0.554839 -0.553724 0.217919 0.209329 0.213291 0.213609 0.237920 0.232983 0.236253 0.235399 0.313455 0.313592 0.244588 0.264611 0.264424 0.244731 0.279067 0.268035 0.267899 0.279424
chargesum: 0.00000
title: Mulliken charges with hydrogens summed into heavy atoms:
elementType: Cl Cl O O N N C C C C C C C C C C
charge: -0.081827 -0.082190 -0.272991 -0.272630 -0.051872 -0.051377 0.076636 0.077131 -0.085401 -0.084918 0.246182 0.245521 0.176727 0.175146 -0.007738 -0.006400
polarizability: 1.91865720e+02 1.33843381e+01 1.45927338e+02 -5.38326265e+00 -1.08877592e+01 1.00299607e+02
1716.lowfreq: -52.6885 -18.8283 -6.2469 -0.1930 -0.0021 0.0015 0.0023 5.3447 16.2172
frequency: -52.5639 -16.0358 15.3165 23.6125 29.3733 35.7453 47.8740 76.8346 81.2823 94.6081 124.8676 127.9211 139.0905 202.3019 209.9312 238.0448 283.4204 332.9772 349.8534 409.1320 433.5354 467.1065 487.4788 558.6679 562.1336 588.0368 590.4165 609.2991 613.6134 670.7377 680.0017 726.6635 792.9551 816.9931 823.1333 901.1285 903.4392 916.3842 980.4237 982.4295 1016.5915 1023.5804 1045.0616 1053.5259 1077.7928 1085.7306 1110.1686 1123.3480 1126.1174 1160.8392 1162.5989 1193.8874 1206.1592 1230.4219 1235.3596 1236.2942 1250.7800 1285.5809 1292.5142 1294.5143 1297.6310 1309.5664 1351.6062 1364.1743 1366.2193 1368.7251 1440.5366 1441.0275 1441.7913 1443.2659 1446.0945 1447.4127 1464.1312 1480.4684 1483.7198 1486.3891 1619.8406 1620.9414 2964.5353 2965.2088 2989.7907 2993.0669 2993.2074 2998.9769 3010.8647 3012.6641 3040.5858 3050.6672 3050.9710 3065.6340 3065.7094 3068.1292 3153.4848 3153.8025 3540.5658 3541.5094
redmass: 1.9564 9.8997 5.7047 7.4051 6.8463 5.1101 7.3054 3.1037 4.8764 2.2727 2.7212 4.8238 3.2183 4.7567 7.8786 6.6093 2.6373 2.3329 4.0072 3.1883 2.9347 2.7973 3.1424 2.5912 2.7550 2.7653 3.1074 1.4409 1.3439 4.3951 3.9819 1.1309 1.4472 2.0663 2.0651 3.1503 1.5411 2.7439 2.4431 2.4374 1.9126 1.8407 3.0114 2.6445 1.7826 2.6233 2.6279 2.2018 1.5496 1.2739 1.2792 1.5442 1.5997 1.2623 1.3399 1.3290 1.5885 1.0547 1.1601 1.1906 1.1815 1.5051 1.5395 1.3667 1.4078 1.6919 1.1177 1.1120 1.1053 1.1260 1.0840 1.0745 1.0784 1.1037 1.8172 1.8642 6.5122 6.4420 1.0592 1.0597 1.0609 1.0590 1.0590 1.0598 1.0977 1.0991 1.1026 1.0974 1.0969 1.0625 1.0620 1.1039 1.1119 1.1119 1.0776 1.0776
irintensity: 0.0071 4.4208 0.9740 5.0596 1.7580 4.9292 0.1702 1.5582 14.2815 4.4943 15.2580 1.4823 0.1253 0.0212 4.8074 0.0176 4.6452 0.4046 51.2769 5.9787 0.0214 10.6171 0.0482 0.1832 57.0745 16.6472 43.4383 56.4656 127.8675 0.0629 15.2930 13.7629 0.0371 0.0376 24.6069 10.3006 7.0582 0.0442 1.4136 40.0527 25.8753 0.1247 0.0310 1.5237 0.1477 0.0022 6.0756 0.1057 0.3556 33.3206 1.2775 28.5856 0.0325 92.5043 0.1501 4.9487 223.4182 0.0259 0.6649 7.2404 64.5352 0.0801 26.2017 0.0148 12.3768 0.0374 50.3956 6.3887 31.1684 3.4968 37.3270 1.8958 0.0013 28.5124 498.5350 4.0483 293.9435 1.2038 28.7781 1.4187 0.0750 86.7095 3.0607 43.4855 0.1811 13.1481 0.0181 5.7690 5.4476 27.6034 15.4751 80.7861 15.6415 14.1716 28.3023 25.2297
temp: 298.150 k
press: 1.00000 atm
elementType: 17 17 8 8 7 7 6 6 6 6 6 6 6 6 6 6 1 1 1 1 1 1 1 1 1 1 1 1 1 1 1 1 1 1
symmnumber: 1
zpe: 727751.5 jmol-1
zpe.correction: 0.277186 hartree
zpe.thermalcorrener: 0.294939 hartree
zpe.thermalcorrenthalpy: 0.295883 hartree
zpe.thermalcorrgfe: 0.225992 hartree
zpe.sumelectzpe: -1570.695673 hartree
zpe.sumelectthermal: -1570.677920 hartree
zpe.sumelectthermalent: -1570.676976 hartree
zpe.sumelectthermalfe: -1570.746867 hartree
dipole: -0.0090 -0.0569 -0.0690
dipole: 0.0899
quadrupole: -104.2717 -124.1683 -107.1467
quadrupole: -10.9237 -2.7625 0.4360
quadrupole: 7.5905 -12.3060 4.7155 -10.9237 -2.7625 0.4360
hfenergy: -1570.972859 hartree
pointgroup: C01 [X(C10H18Cl2N2O2)]
dipole: -0.0023183 0.0261182 0.0237307 debye
polarizability: 189.5551728|-15.3770303|143.9962934|8.1546477|-17.6028301|104.5411986 unknown
InChI: InChI=1S/C10H18Cl2N2O2/c11-5-7-13-9(15)3-1-2-4-10(16)14-8-6-12/h13-14H,1-8H2
charge 0 multiplicity 1
34 atoms
Cl 7.003254 -1.735715 0.433877
Cl -7.012334 1.731995 -0.101235
O  3.15675 1.724791 -0.534611
O  -3.129531 -1.770741 0.342514
N  4.346166 0.085008 0.605816
N  -4.350219 -0.027301 -0.59265
C  0.621581 0.464985 -0.118727
C  -0.618746 -0.427744 0.093496
C  1.916314 -0.226345 0.348762
C  -1.915695 0.268481 -0.360315
C  3.170055 0.622482 0.093517
C  -3.16109 -0.60794 -0.164136
C  5.646045 0.736382 0.428016
C  -5.641798 -0.706316 -0.465806
C  6.612116 -0.082867 -0.426816
C  -6.585863 -0.017093 0.518572
H  0.724071 0.735717 -1.186753
H  0.505096 1.421655 0.426212
H  -0.506376 -1.378902 -0.461296
H  -0.71469 -0.709098 1.159648
H  2.033108 -1.198228 -0.174069
H  1.850565 -0.463474 1.430336
H  -1.838673 0.552115 -1.429969
H  -2.051569 1.21579 0.201382
H  4.328024 -0.820004 1.081322
H  -4.347862 0.926961 -0.959645
H  6.109038 0.957048 1.40842
H  5.445179 1.697954 -0.083121
H  -5.422723 -1.725677 -0.092694
H  -6.13178 -0.797621 -1.453597
H  6.183052 -0.359956 -1.40026
H  7.586334 0.414364 -0.544212
H  -7.553363 -0.53471 0.59749
H  -6.128538 0.131502 1.507132
