program: Gaussian 09
title: 000233979
version: EM64L-G09RevD.01
frameworkgroup: C1[X(C9H10ClNO2)]
method: RPBEPBE
basis: SDD
operation: Freq
keyword: #p
keyword: freq=noraman
keyword: PBEPBE/SDD
title: #p freq=noraman PBEPBE/SDD
converged: YES YES NO NO
title: Mulliken charges:
elementType: Cl O O N C C C C C C C C C H H H H H H H H H H
charge: -0.050691 -0.451134 -0.290731 -0.377465 -0.352844 0.286591 0.174071 -0.345820 -0.342445 -0.337488 -0.212547 -0.223698 -0.093678 0.221535 0.257736 0.325498 0.205102 0.237018 0.281994 0.226527 0.259592 0.258077 0.344800
chargesum: 0.00000
title: Mulliken charges with hydrogens summed into heavy atoms:
elementType: Cl O O N C C C C C C C C C
charge: -0.050691 -0.106335 -0.290731 -0.051967 0.126428 0.286591 0.174071 0.096301 -0.060451 -0.110961 0.047045 0.034379 -0.093678
polarizability: 1.88069609e+02 -7.11263440e+00 1.18280829e+02 4.49811405e-01 -2.03137831e+00 6.06521538e+01
1716.lowfreq: -5.2889 -3.0933 -0.0027 -0.0021 -0.0017 8.4404 24.9402 53.8863 64.2121
frequency: 24.7308 53.8803 64.1907 67.7466 116.6510 158.6185 232.0229 254.2625 280.4320 305.8160 317.9843 347.8200 407.7776 436.3681 473.8240 496.9474 521.1552 622.5970 654.6161 678.0750 700.7597 741.3989 799.2340 825.3660 851.9657 870.7031 886.6839 952.0434 987.1314 998.3876 1015.2201 1040.0199 1069.2065 1077.8570 1110.5360 1150.0226 1175.3552 1189.8304 1218.2900 1271.3356 1296.6395 1323.0468 1356.9189 1369.4273 1373.0377 1393.4641 1460.6716 1464.5687 1475.2146 1497.8749 1564.2048 1597.0439 1601.8162 2951.7547 2995.4263 3061.9883 3099.7713 3132.3331 3156.8986 3172.0286 3177.1754 3537.4495 3562.6255
redmass: 4.1271 5.7893 4.7544 5.4222 4.0520 6.6536 4.9456 6.3669 9.3131 5.1374 2.8949 1.0835 2.8635 4.3259 4.6203 4.1554 3.1621 6.5278 1.3945 2.8953 5.9678 3.4107 2.6083 1.3849 1.5178 4.2155 2.4757 1.3746 1.3740 4.0026 1.8746 1.9463 3.8477 2.4478 1.3659 2.2004 1.2889 1.3051 1.2924 1.8249 1.3033 1.2661 1.4457 5.0217 1.2116 4.0805 1.1186 2.0095 1.0773 2.3662 8.3792 6.3128 7.8294 1.0697 1.0661 1.0912 1.1003 1.0896 1.0888 1.0953 1.0971 1.0770 1.0664
irintensity: 0.0889 2.9577 2.2116 2.4580 10.1301 12.3601 0.9917 8.9259 3.5080 18.6898 7.9042 162.5095 0.1676 5.8848 13.0498 26.0142 4.7266 7.2924 134.7324 7.3688 15.8304 28.4688 6.1240 17.0228 38.5821 29.3524 4.7368 0.1031 3.3000 43.6627 92.0708 3.1858 19.4227 23.2921 14.9191 13.9083 19.8271 1.7809 27.5228 123.8607 9.2452 12.1775 14.7533 0.3771 10.6185 3.4241 42.0241 224.4428 18.2812 184.7588 68.0401 90.8836 76.1617 58.2774 78.8312 11.3030 27.0007 10.6731 0.1146 3.9687 2.3079 44.6953 4.8222
temp: 298.150 k
press: 1.00000 atm
elementType: 17 8 8 7 6 6 6 6 6 6 6 6 6 1 1 1 1 1 1 1 1 1 1
symmnumber: 1
zpe: 460970.5 jmol-1
zpe.correction: 0.175574 hartree
zpe.thermalcorrener: 0.188308 hartree
zpe.thermalcorrenthalpy: 0.189252 hartree
zpe.thermalcorrgfe: 0.134271 hartree
zpe.sumelectzpe: -1013.260439 hartree
zpe.sumelectthermal: -1013.247705 hartree
zpe.sumelectthermalent: -1013.246761 hartree
zpe.sumelectthermalfe: -1013.301743 hartree
dipole: -3.2752 -1.9778 -1.3092
dipole: 4.0439
quadrupole: -70.8956 -90.0697 -82.6261
quadrupole: 5.3390 4.8676 0.1184
quadrupole: 10.3015 -8.8726 -1.4290 5.3390 4.8676 0.1184
hfenergy: -1013.4360132 hartree
pointgroup: C01 [X(C9H10Cl1N1O2)]
dipole: -1.2961541 -0.7862529 -0.4827361 debye
dipolederiv: -0.8801275 0.2157767 -0.0258696 0.239581 -0.1892441 0.0203427 -0.026404 0.0181952 -0.0714025 -0.5875427 -0.1334243 0.1747484 -0.2994917 -0.7722582 -0.151195 0.2091793 -0.1613734 -0.3106675 -0.8003375 0.1865894 -0.0242473 -0.0754768 -0.9853779 -0.0601446 -0.0497388 -0.0175992 -0.3763575 -1.2914692 -0.321481 -0.0844747 -0.5065901 -0.6080623 0.0123427 0.0026537 0.0594713 -0.4472338 0.5498909 -0.0385485 0.1098231 -0.269307 -0.0449495 -0.058687 0.0854052 -0.0206936 0.2725034 -0.4300071 0.0810439 -0.0090689 0.1565864 -0.1260729 0.0035642 -0.0051972 -0.0075637 -0.008123 1.7903864 0.0485211 0.1300995 0.3752002 1.2336396 0.1243083 0.1788399 0.0666178 0.2344364 0.3655021 0.0577524 -0.0443429 0.1696907 0.6077259 0.1708024 -0.0897317 0.1639038 0.333566 0.0802553 -0.0878311 0.0121695 0.1040295 0.041927 -0.0366075 0.0017768 -0.015385 -0.1011518 0.0844171 0.0246853 -0.0257362 -0.1195558 0.0454668 -0.0457735 -0.043844 -0.0361536 -0.1252264 -0.2674396 0.2030162 -0.0396256 0.2214053 -0.1024159 -0.005367 -0.0404039 -0.0066201 -0.1084329 -0.4713629 0.040885 0.0015075 -0.0236002 0.01544 -0.0289964 0.0122916 -0.0291955 -0.0977008 1.2615369 -0.3335046 0.0317354 -0.315763 0.2486769 -0.056489 0.0234042 -0.0534984 -0.0499064 -0.1389717 -0.0277693 -0.0678299 0.0286961 0.0839704 0.0176837 -0.1351468 0.0468393 -0.1520817 0.0915233 -0.0368622 -0.0078684 0.0918513 -0.0017417 -0.0692329 0.0358121 -0.0537983 0.0616889 0.2819302 0.0546055 -0.0011861 0.168931 0.1666748 -0.0208593 -0.0087333 -0.0418969 0.2976699 -0.2526539 0.0490944 0.0249575 0.0222376 -0.0201751 -0.0395225 -0.0324427 -0.0192418 0.0776025 0.1186233 0.0184612 -0.0706709 0.0015954 0.0246769 0.0272474 -0.0186654 -0.0047387 -0.1089637 0.1356778 0.0452159 -0.008216 0.0006242 0.0185664 0.0328382 -0.0174662 0.0226535 0.1500182 -0.0344433 -0.0934389 0.0279826 -0.0969592 0.0321118 0.0290151 0.0382115 0.0213373 0.1374073 -0.000494 -0.06753 0.0183447 -0.0630421 0.0499167 0.0260292 0.0183103 0.0262587 0.1590412 0.0747557 0.0381718 -0.0048968 0.0423966 -0.024835 0.0418817 -0.0031024 0.0427959 0.1563417 0.3203505 0.0765711 -0.1173348 0.1469605 0.3063394 0.0668191 -0.1350083 -0.0003144 0.0769726 unknown
polarizability: 187.6332247|-8.4582602|117.9927873|3.5324298|-6.5346391|61.37658 unknown
InChI: InChI=1S/C9H10ClNO2/c10-8-3-1-7(2-4-8)9(13)11-5-6-12/h1-4,11-12H,5-6H2
charge 0 multiplicity 1
23 atoms
Cl 4.907721 -0.944621 0.06906
O  -3.902916 -1.98779 -0.311584
O  -1.163723 2.230451 -0.083382
N  -1.935088 0.050444 -0.290867
C  -3.349613 0.432976 -0.326601
C  0.487199 0.445472 -0.090009
C  -0.922326 0.981053 -0.150644
C  -4.193405 -0.678809 0.315201
C  1.540597 1.370701 -0.302913
C  0.806053 -0.909121 0.191039
C  2.887841 0.958431 -0.260281
C  2.150279 -1.338017 0.24223
C  3.170765 -0.395724 0.008447
H  -3.682284 0.610451 -1.372176
H  -3.461382 1.388997 0.215105
H  -1.740705 -0.942395 -0.439824
H  -5.272309 -0.433529 0.251965
H  -3.914194 -0.815254 1.372028
H  1.277636 2.415982 -0.493511
H  0.02221 -1.6443 0.407101
H  3.699594 1.671405 -0.429822
H  2.398343 -2.378998 0.467449
H  -4.322293 -2.019805 -1.208712
