program: Gaussian 09
title: 000233977
version: EM64L-G09RevD.01
frameworkgroup: C1[X(C10H12O2)]
method: RPBEPBE
basis: SDD
operation: Freq
keyword: #pfreq=noraman
keyword: PBEPBE/SDD
title: #p freq=noraman PBEPBE/SDD
converged: YES YES NO NO
title: Mulliken charges:
elementType: O O C C C C C C C C C C H H H H H H H H H H H H
charge: -0.270213 -0.446046 -0.039974 -0.273339 -0.601715 0.294534 0.264089 -0.399283 -0.412810 -0.229533 -0.225742 -0.511991 0.222593 0.220819 0.246654 0.235889 0.259211 0.241623 0.339106 0.225503 0.224804 0.187610 0.209864 0.238348
chargesum: 0.00000
title: Mulliken charges with hydrogens summed into heavy atoms:
elementType: O O C C C C C C C C C C
charge: -0.270213 -0.106940 0.182619 -0.052520 -0.119173 0.294534 0.264089 -0.140072 -0.171187 -0.004029 -0.000938 0.123830
polarizability: 1.49920969e+02 -1.89440307e+00 1.13505952e+02 2.94095761e+00 -3.95190453e+00 6.33590361e+01
1716.lowfreq: -8.1677 -0.0012 -0.0010 -0.0009 0.9450 9.1148 42.8710 84.3176 125.4813
frequency: 42.7319 84.3063 125.4803 179.2534 189.0970 228.1180 239.5981 260.5958 324.0134 341.5478 410.4911 438.3019 477.7226 506.4204 546.8627 600.1904 629.9179 716.7433 752.5343 794.0335 844.3660 847.5236 882.1452 931.0866 948.1189 988.0279 996.0757 1018.2091 1020.3839 1049.4744 1074.5701 1099.7964 1111.3662 1138.3336 1156.0853 1167.7356 1170.1776 1188.3019 1210.9260 1227.3272 1248.3068 1275.2016 1297.4176 1343.3465 1362.7408 1393.0643 1435.1682 1450.0389 1457.3488 1460.5928 1474.8944 1476.8406 1599.2096 1623.4763 2916.6930 2931.3973 2951.2778 2992.6328 2995.8421 3063.8840 3098.0762 3121.4077 3133.6874 3148.7742 3163.4229 3570.3989
redmass: 3.4897 2.5411 3.8761 3.1279 1.4965 2.2419 1.4838 2.1067 4.1708 4.1097 3.8664 3.3120 3.7473 3.9344 3.4765 4.8185 4.7909 3.6424 1.3503 3.1465 3.3250 2.2438 1.4832 3.0611 1.5488 1.3196 6.4458 2.3721 2.1953 3.5575 4.0821 2.0344 1.2765 1.3173 1.4655 1.1482 1.2737 1.5611 1.5225 1.3249 1.5696 1.5944 1.4795 1.3053 1.6029 6.1349 1.1344 2.4699 1.0716 1.1810 1.0677 2.4122 7.0859 7.2932 1.0376 1.0818 1.0851 1.0640 1.0983 1.0989 1.0972 1.0856 1.0900 1.0947 1.0997 1.0664
irintensity: 0.4316 3.1578 1.6998 20.7466 2.4331 6.9424 101.9286 33.6878 0.5290 12.3255 2.2966 13.7690 1.2587 1.0907 3.6178 7.5674 7.4773 1.9514 66.0990 14.7025 4.5008 3.5993 1.9298 26.7931 13.6149 0.1277 44.8397 16.3900 4.2315 27.1735 100.5224 5.6460 0.7707 10.8714 30.4491 5.1247 30.2896 2.8045 10.0855 3.3742 0.5187 3.5963 1.0700 38.2055 10.1816 3.5517 5.3572 6.3176 8.1151 18.6700 9.6988 14.9107 0.9625 2.4576 77.0368 18.8076 52.3817 19.0460 77.8809 22.7920 35.1881 1.1601 13.3675 27.3352 25.5821 2.1277
temp: 298.150 k
press: 1.00000 atm
elementType: 8 8 6 6 6 6 6 6 6 6 6 6 1 1 1 1 1 1 1 1 1 1 1 1
symmnumber: 1
zpe: 514054.1 jmol-1
zpe.correction: 0.195793 hartree
zpe.thermalcorrener: 0.206928 hartree
zpe.thermalcorrenthalpy: 0.207872 hartree
zpe.thermalcorrgfe: 0.158754 hartree
zpe.sumelectzpe: -537.792209 hartree
zpe.sumelectthermal: -537.781074 hartree
zpe.sumelectthermalent: -537.780130 hartree
zpe.sumelectthermalfe: -537.829248 hartree
dipole: -1.3368 0.3431 -0.3058
dipole: 1.4136
quadrupole: -58.7663 -68.6841 -74.5778
quadrupole: -6.4607 -0.9111 -4.6069
quadrupole: 8.5765 -1.3414 -7.2351 -6.4607 -0.9111 -4.6069
hfenergy: -537.9880019 hartree
pointgroup: C01 [X(C10H12O2)]
dipole: -0.5141577 -0.119123 0.1753581 debye
dipolederiv: -1.1631996 -0.0718344 0.0653087 -0.0280926 -0.3990736 0.0503224 0.149903 0.0238342 -0.4272312 -0.388769 -0.0786937 -0.1991242 -0.1639859 -0.8167049 0.0259539 -0.2775729 -0.0872328 -0.3735712 0.8506562 -0.0519627 -0.1013199 -0.2100329 0.0883579 0.0378413 -0.1505605 0.0219563 0.3625606 0.3217882 0.1940373 0.0513659 0.329208 0.5959117 0.0291746 0.1220153 0.0902682 0.3016218 -0.1333339 0.0040144 0.0154005 0.032327 0.0064848 -0.0244082 0.0525316 -0.0417825 0.1519917 -0.0036724 -0.0195305 -0.0283417 0.1854187 -0.1358626 -0.0214045 -0.1538659 -0.0280064 -0.0370965 0.1458392 -0.1394112 0.0056279 -0.2669817 0.0390368 0.0080741 -0.0319688 0.0279376 -0.0478297 -0.0536331 0.0362884 -0.0113629 -0.0254546 0.0961456 -0.0476828 0.0461841 -0.0124505 -0.1281847 -0.129551 0.0789364 -0.0251082 0.0780608 0.0842926 -0.0663071 -0.0162815 -0.074106 -0.1396989 -0.0032533 -0.0806408 -0.0063472 -0.112948 -0.0240657 -0.019368 0.0010579 -0.0225726 -0.1652806 0.0495845 0.0148364 -0.0350763 0.0719601 -0.0142039 -0.0435199 -0.0420655 -0.0412167 -0.1429441 0.5936206 0.1184721 -0.0028676 0.2533891 0.3613798 -0.0721398 0.1272765 -0.0533091 0.3140683 -0.0398244 -0.0138128 -0.0554736 0.0208906 0.0215673 -0.0757693 -0.0113869 -0.0411732 -0.1492654 -0.0485857 -0.0352155 0.0683394 -0.0856 -0.0309883 -0.0077568 0.0544391 -0.0098054 -0.1561193 0.0308756 0.0522758 0.0183829 0.0387535 0.0283294 -0.0636919 0.0223158 -0.1074296 -0.0351195 0.0222163 0.0121234 -0.0102604 0.0182616 -0.0255171 0.0964599 -0.0499446 0.1472611 -0.0258366 0.1010388 -0.0286589 0.0140853 -0.002504 -0.0586834 0.0550908 0.0107942 0.0481459 0.1382795 0.0810031 -0.0051845 0.0088914 -0.0394251 -0.0987903 0.0672765 0.0184727 0.0663607 0.1355374 0.0638209 -0.1056932 0.1475094 -0.0507074 0.3308561 -0.0346812 0.1555402 0.0085748 0.2298117 -0.0742057 0.1047068 0.0015785 0.112264 0.0084919 0.0213154 0.0002289 0.018314 0.1545061 -0.1200608 -0.0644269 0.0493714 -0.066774 0.066875 0.0306581 0.0541866 0.0331114 0.1428134 0.0005639 0.0450474 -0.0459215 -0.0828257 -0.1984711 0.1405291 -0.0443565 0.1310842 -0.0153256 0.0295178 -0.0248831 0.0059195 -0.1082727 0.0319752 -0.0436588 -0.1171874 -0.0691507 -0.1726201 -0.1324364 0.0592098 0.0694227 0.1030712 0.0426568 -0.0423077 0.0802446 -0.0286126 0.0849328 unknown
polarizability: 148.960431|0.756545|111.7864835|-9.5159474|-10.0285179|66.0390425 unknown
InChI: InChI=1S/C10H12O2/c1-12-9-6-7-4-2-3-5-8(7)10(9)11/h2-5,9-11H,6H2,1H3
charge 0 multiplicity 1
24 atoms
O  -2.810095 0.873629 0.501296
O  -1.230708 -2.09953 -0.075887
C  -1.594415 0.427907 -0.180996
C  -0.86985 -0.788331 0.489454
C  -0.564653 1.587834 -0.152537
C  0.595111 -0.496605 0.223344
C  0.772908 0.863162 -0.137154
C  1.687762 -1.379607 0.301609
C  2.062032 1.358974 -0.415719
C  2.98338 -0.882307 0.018931
C  3.168413 0.477742 -0.332982
C  -3.937978 -0.043976 0.35542
H  -1.826262 0.129427 -1.228372
H  -1.086166 -0.766962 1.582335
H  -0.723207 2.169732 0.776781
H  -0.684618 2.282698 -1.001196
H  1.527848 -2.433139 0.552842
H  2.210298 2.407001 -0.700977
H  -2.073228 -2.41366 0.338156
H  3.848798 -1.552993 0.066061
H  4.176319 0.848457 -0.552465
H  -3.801933 -0.974273 0.949893
H  -4.104646 -0.31962 -0.707196
H  -4.82011 0.491441 0.741157
