program: Gaussian 09
title: 000233972
version: EM64L-G09RevD.01
frameworkgroup: C1[X(C9H8BrClO2)]
method: RPBEPBE
basis: SDD
operation: Freq
keyword: #p
keyword: freq=noraman
keyword: PBEPBE/SDD
title: #p freq=noraman PBEPBE/SDD
converged: YES YES NO NO
title: Mulliken charges:
elementType: Br Cl O O C C C C C C C C C H H H H H H H H
charge: 0.006279 -0.045750 -0.289871 -0.252221 -0.000890 -0.309953 0.268282 0.235858 -0.639184 -0.314263 -0.359357 -0.211864 -0.181467 0.269820 0.219018 0.251271 0.295435 0.272188 0.273688 0.259157 0.253825
chargesum: 0.00000
title: Mulliken charges with hydrogens summed into heavy atoms:
elementType: Br Cl O O C C C C C C C C C
charge: 0.006279 -0.045750 -0.289871 -0.252221 0.268930 0.160336 0.268282 0.235858 -0.071562 -0.040575 -0.100200 -0.211864 0.072358
polarizability: 2.08294428e+02 1.00960463e+01 1.14030488e+02 -8.42533108e-02 -3.46773463e+00 6.06632511e+01
1716.lowfreq: -6.1304 0.0013 0.0015 0.0024 5.4031 8.0960 35.0355 74.3116 93.5891
frequency: 34.9695 74.3035 93.5707 124.4591 156.6264 184.8323 232.5518 247.6792 274.1857 337.1751 400.5633 403.4975 447.0663 480.4057 515.7288 567.5131 589.2749 652.3963 699.6244 703.4662 734.6071 806.3823 825.7560 842.4866 869.5943 897.9381 939.5503 979.7796 1020.0562 1039.7884 1057.4095 1094.8571 1136.2193 1160.8650 1166.2219 1216.8106 1237.3571 1252.6172 1262.5809 1316.0227 1323.2020 1367.2789 1380.1880 1404.2828 1455.4760 1456.8267 1467.4179 1580.1263 1602.7400 2993.2091 3019.5161 3069.7791 3118.6864 3156.5602 3162.5832 3179.5059 3184.5315
redmass: 9.7399 8.0639 5.3233 4.2879 9.8216 3.8853 4.5352 7.1398 10.3602 6.6884 4.6449 2.8867 3.1731 5.3752 6.8318 4.8361 7.1040 4.2848 4.2621 6.3046 5.7726 1.4053 4.6407 2.1638 1.4213 2.7674 1.3306 6.7485 1.9688 1.9718 1.8996 2.6984 2.1402 1.4046 1.8819 1.4144 1.9452 1.4618 1.2189 1.2495 1.3439 2.0260 3.7086 3.4822 1.2029 1.1686 2.1187 8.8294 7.6320 1.0685 1.0836 1.0569 1.0989 1.1111 1.0887 1.0929 1.0969
irintensity: 0.2975 2.6457 1.6177 5.9385 3.2110 2.4719 1.6292 2.5474 1.9623 3.3801 6.8788 6.9927 6.0217 1.0657 5.9609 10.5220 11.1053 20.1203 0.3058 10.8174 24.5834 47.5730 14.9063 50.1202 28.2333 95.2891 1.5716 51.8397 36.1287 23.4097 7.1960 33.8548 5.4420 4.4653 11.9769 30.7688 152.9919 59.5092 2.6261 20.2646 1.0730 30.5151 25.2489 6.1040 51.4782 21.2290 247.0005 24.8560 21.4803 36.4635 24.0412 10.7759 8.4747 6.0387 1.3706 0.5416 2.2037
temp: 298.150 k
press: 1.00000 atm
elementType: 35 17 8 8 6 6 6 6 6 6 6 6 6 1 1 1 1 1 1 1 1
symmnumber: 1
zpe: 394759.9 jmol-1
zpe.correction: 0.150356 hartree
zpe.thermalcorrener: 0.162180 hartree
zpe.thermalcorrenthalpy: 0.163125 hartree
zpe.thermalcorrgfe: 0.110201 hartree
zpe.sumelectzpe: -970.752105 hartree
zpe.sumelectthermal: -970.740281 hartree
zpe.sumelectthermalent: -970.739336 hartree
zpe.sumelectthermalfe: -970.792259 hartree
dipole: 1.6070 0.1939 0.7466
dipole: 1.7826
quadrupole: -100.1634 -88.7662 -92.5598
quadrupole: -3.4293 3.5220 -0.0089
quadrupole: -6.3336 5.0636 1.2700 -3.4293 3.5220 -0.0089
hfenergy: -970.902461 hartree
pointgroup: C01 [X(C9H8Br1Cl1O2)]
dipole: -0.6136203 0.262689 -0.2152068 debye
dipolederiv: -0.516874 0.2793459 0.0818539 0.3332409 -0.2755122 -0.0688823 0.0979033 -0.0745912 -0.0600797 -0.5334145 0.0426843 0.0654304 0.0930247 -0.194999 -0.0365094 0.1159237 -0.0342654 -0.2000439 -1.8292117 -0.05794 0.080385 -0.2414049 -0.3601954 0.0230854 -0.055503 -0.0089557 -0.2549053 -1.3923256 0.359901 0.018411 0.3834385 -0.5137273 -0.0021265 0.1238302 -0.0635179 -0.2790288 0.8136008 -0.0344466 -0.1338345 -0.2701876 0.1755933 -0.0439047 -0.1589272 -0.01812 0.2712528 0.6762974 -0.1130891 0.0884857 0.289976 0.0759922 -0.0205087 0.2207343 -0.0384098 0.3335699 1.2125814 0.1639558 -0.0072057 0.7460387 0.0876639 -0.0302241 0.2401918 -0.0420274 0.0278104 0.7353989 -0.4086373 -0.0702093 -0.9318213 0.3205966 0.0139577 -0.3263271 0.0440609 0.0358436 0.6080054 -0.1197606 -0.1520734 -0.239599 0.1952669 0.0622345 -0.1886858 0.0507563 0.2569369 -0.4481373 0.039712 0.0322324 0.1936339 -0.0955448 0.0074721 0.0923635 0.0112959 -0.1028861 -0.0185429 0.06406 0.0019875 0.0367896 0.0153171 0.0574059 -0.0247396 0.0759112 -0.130484 0.8452752 -0.483499 -0.146831 -0.6254783 0.4491128 0.1752401 -0.1865328 0.1864028 -0.0865683 -0.2737132 0.176724 0.0590309 0.1880506 -0.1603476 -0.0094299 0.0566583 -0.0103301 -0.122544 -0.0138604 0.008633 -0.0196865 0.062939 0.0307753 0.0038685 0.0650295 0.0164921 -0.10968 -0.0048533 -0.0035792 0.0087018 -0.0935479 0.0786956 -0.0179216 -0.1162754 0.0619506 -0.1383054 -0.0193368 0.0760207 0.0165769 0.1017826 0.0639725 -0.0278959 0.0417304 -0.0480202 0.0775244 0.0008371 0.0388593 0.0427207 -0.0112278 -0.0537035 0.0059938 0.0274609 0.0176359 0.0850022 0.0009928 0.0316601 0.0560715 0.048078 0.081255 0.0331298 -0.0018074 -0.0017772 -0.0838679 0.1140055 -0.0259535 -0.0094355 -0.016462 0.0149974 -0.0442553 -0.0097019 -0.0412818 0.1617091 0.0777192 0.0156562 0.0053105 -0.0023983 -0.0287771 -0.0575398 -0.0012479 -0.0529811 0.1572129 -0.0344439 -0.0503071 -0.0179223 -0.0448654 0.0935682 -0.0231896 -0.0120781 -0.0302279 0.1615312 unknown
polarizability: 199.7140808|-26.6409546|117.3794407|-11.4003273|17.4972655|65.8946458 unknown
InChI: InChI=1S/C9H8BrClO2/c10-6-1-2-8-9(3-6)13-7(4-11)5-12-8/h1-3,7H,4-5H2
charge 0 multiplicity 1
21 atoms
Br 4.202163 -1.690317 -0.588636
Cl -4.925096 0.11502 0.476264
O  -1.043324 -0.83044 -0.333927
O  -0.676645 1.964063 0.436252
C  -2.146397 -0.010069 0.241723
C  -1.940759 1.463365 -0.14192
C  0.239378 -0.254568 -0.18005
C  0.417598 1.101227 0.207472
C  -3.409128 -0.643626 -0.339239
C  1.355618 -1.081606 -0.419213
C  1.718108 1.613452 0.381858
C  2.644492 -0.542484 -0.251741
C  2.845452 0.794314 0.156636
H  -2.123825 -0.114438 1.344041
H  -1.910841 1.570146 -1.244771
H  -2.732152 2.100771 0.279373
H  -3.442977 -1.719627 -0.120131
H  -3.507691 -0.461982 -1.419438
H  1.194468 -2.120178 -0.718575
H  1.834781 2.657792 0.685855
H  3.853875 1.19388 0.28907
