program: Gaussian 09
title: 000233966
version: EM64L-G09RevD.01
frameworkgroup: C1[X(C9H9BrO3)]
method: RPBEPBE
basis: SDD
operation: Freq
keyword: #p
keyword: freq=noraman
keyword: PBEPBE/SDD
title: #p freq=noraman PBEPBE/SDD
converged: YES YES NO NO
title: Mulliken charges:
elementType: Br O O O C C C C C C C C C H H H H H H H H H
charge: 0.006368 -0.310760 -0.255464 -0.429997 -0.066530 -0.330472 -0.340619 0.249958 0.270604 -0.358742 -0.317018 -0.184181 -0.209830 0.264680 0.223619 0.234306 0.198050 0.216201 0.254155 0.274886 0.253422 0.357364
chargesum: 0.00000
title: Mulliken charges with hydrogens summed into heavy atoms:
elementType: Br O O O C C C C C C C C C
charge: 0.006368 -0.310760 -0.255464 -0.072633 0.198150 0.127453 0.073632 0.249958 0.270604 -0.104587 -0.042132 0.069241 -0.209830
polarizability: 1.94017966e+02 6.45256910e+00 1.12411062e+02 2.18106058e+00 -3.06240165e+00 5.98659211e+01
1716.lowfreq: 0.0010 0.0010 0.0011 4.5003 6.9178 12.9067 44.9023 80.4269 125.3863
frequency: 44.8896 80.4256 125.3822 129.9740 152.5089 189.3028 238.6620 254.5965 330.6480 340.3409 408.9143 441.7986 446.4655 464.0231 479.0599 503.9189 565.2463 581.1938 663.6694 699.9774 736.1208 803.7634 809.6408 865.5372 869.9431 921.6847 936.1811 954.9294 1000.1448 1051.8784 1060.8659 1079.4346 1086.9692 1116.2028 1165.3617 1195.3197 1215.8150 1233.1826 1251.0891 1273.8350 1317.6780 1345.9415 1356.1735 1383.2328 1392.4836 1400.4035 1455.3310 1463.6706 1468.9293 1578.5552 1603.6080 2965.9983 2997.1087 3015.7661 3080.5586 3102.7738 3160.7932 3180.7689 3184.8305 3549.9261
redmass: 8.2734 4.2690 6.6382 4.6640 4.4034 3.7113 4.8164 6.3322 6.1818 4.5496 4.4872 1.2721 3.0997 2.8539 6.1801 4.0881 4.9526 4.7047 5.2000 4.0732 5.1302 1.4318 4.2837 4.7116 1.4542 1.5813 1.3327 8.7331 4.9523 2.4573 2.0412 2.5881 2.7589 2.1074 1.8537 1.2344 1.2414 2.1873 1.4279 1.4390 1.2917 1.2567 1.6430 2.9971 1.4847 3.0627 1.1363 1.4468 1.7157 8.8012 7.6335 1.0682 1.0693 1.0796 1.0960 1.1009 1.0889 1.0929 1.0966 1.0656
irintensity: 0.2599 5.6252 1.1313 2.9991 4.4098 0.2221 3.2322 4.0623 0.6621 7.9361 7.1466 202.3903 2.7926 7.2285 8.0525 5.7904 6.8408 8.7810 21.9357 1.0444 20.8685 49.6961 57.5099 11.9559 26.2388 11.7502 1.7255 145.1366 59.6484 42.8971 8.7856 15.5937 39.5082 9.4945 17.0739 34.9293 20.9538 117.3500 48.4151 51.9856 6.9251 20.2607 49.2079 31.6113 12.8383 11.2072 22.3741 86.5377 184.8332 16.8299 20.4665 43.8703 34.7921 45.7395 16.9728 24.8548 2.2315 0.5981 2.3262 9.7583
temp: 298.150 k
press: 1.00000 atm
elementType: 35 8 8 8 6 6 6 6 6 6 6 6 6 1 1 1 1 1 1 1 1 1
symmnumber: 1
zpe: 429300.4 jmol-1
zpe.correction: 0.163512 hartree
zpe.thermalcorrener: 0.175283 hartree
zpe.thermalcorrenthalpy: 0.176227 hartree
zpe.thermalcorrgfe: 0.124348 hartree
zpe.sumelectzpe: -586.494423 hartree
zpe.sumelectthermal: -586.482652 hartree
zpe.sumelectthermalent: -586.481708 hartree
zpe.sumelectthermalfe: -586.533587 hartree
dipole: 1.9219 0.6308 1.1141
dipole: 2.3093
quadrupole: -93.9558 -79.2274 -87.5055
quadrupole: 10.0749 5.1886 -0.7376
quadrupole: -7.0596 7.6688 -0.6093 10.0749 5.1886 -0.7376
hfenergy: -586.6579345 hartree
pointgroup: C01[X(C9H9Br1O3)]
dipole: -0.7507498 0.230666 -0.4567592 debye
dipolederiv: -0.7292483 -0.0634179 -0.0459699 -0.1015555 -0.0781114 -0.0094735 -0.0543668 -0.0115735 -0.0426121 -1.7603748 0.1156589 0.0273514 0.1318106 -0.3770303 0.0131847 -0.0521248 -0.0078145 -0.2768675 -1.2017853 0.393085 -0.0479016 0.5680936 -0.7183768 0.0646577 0.0301878 -0.0171299 -0.2695597 -0.5142656 -0.195928 -0.1319286 -0.3535178 -0.6308593 0.1178381 -0.1351358 0.0877976 -0.4975924 0.499623 -0.1707792 -0.0935601 -0.594411 0.2329698 0.0636492 -0.2165995 0.0995178 0.2827171 0.7198933 -0.2378291 0.112485 0.1609725 0.1459539 0.0018211 0.1463116 -0.0262571 0.3360033 0.3742517 0.1110859 0.0013396 0.1296818 0.518126 -0.1303993 0.0694427 -0.0795864 0.4019028 1.3383088 -0.0465197 -0.0020159 0.4774479 -0.1366701 -0.0189633 0.1483862 -0.0695028 0.0377244 0.4946117 -0.3860911 0.0074622 -0.9383571 0.6347394 -0.0490003 -0.1470156 0.0117734 0.03941 -0.0681374 -0.0172604 0.0193741 -0.0007598 0.051894 0.0198524 0.0510133 0.0237108 -0.1505497 -0.4573086 0.1618094 -0.0178934 -0.0388459 -0.0445348 0.0143516 -0.0483799 0.040305 -0.107419 -0.4133834 -0.0654233 -0.0257157 -0.0633727 -0.0331254 0.0094044 -0.0242708 0.0061738 -0.1223804 1.2490601 0.0969802 0.0966395 0.2411297 0.1051854 0.0365909 0.119017 0.0371157 -0.129571 0.0135931 0.0080969 -0.0436632 0.1111444 0.0205117 0.0045553 0.052586 -0.0282324 -0.1174254 -0.026774 0.028225 -0.007417 -0.079616 0.0949719 -0.0510333 -0.088342 0.0487409 -0.1378757 -0.0202979 0.0893738 0.0047616 0.1224146 -0.022195 -0.0281886 0.0258141 -0.0577051 0.0829722 0.0575006 -0.0361899 0.0387134 -0.0473705 0.008637 0.0251646 -0.0319052 0.0600583 -0.2086161 -0.0170311 0.0760757 0.0281345 0.0760381 -0.0547525 -0.0172005 0.0597005 -0.0545806 0.0708617 0.0430821 -0.071863 -0.0143282 -0.0547648 -0.0134725 -0.0193873 -0.0092216 -0.0156486 0.1688513 0.1004013 -0.0272156 -0.005029 -0.0375809 0.0139506 -0.016309 -0.0023514 -0.0146498 0.1722334 0.0339926 0.0786615 0.0013712 0.0728879 0.0160188 -0.0121065 -0.0072947 -0.015492 0.1690349 0.284288 0.1594649 0.0977903 0.218531 0.2661695 -0.0190082 0.1145492 -0.0170205 0.2987576 unknown
polarizability: 194.0631598|-5.0670603|112.2683943|5.0403965|2.4714391|59.9633952 unknown
InChI: InChI=1S/C9H9BrO3/c10-6-1-2-8-9(3-6)12-5-7(4-11)13-8/h1-3,7,11H,4-5H2
charge 0 multiplicity 1
22 atoms
Br 4.739837 0.14229 0.201466
O  -1.356253 -0.789119 -0.219956
O  -0.276662 1.906898 0.066298
O  -4.053781 -1.257436 0.448277
C  -2.196558 0.355567 0.243208
C  -1.663903 1.648359 -0.383406
C  -3.624291 -0.008444 -0.175727
C  0.033434 -0.546679 -0.135215
C  0.554474 0.768492 0.012003
C  0.910788 -1.645866 -0.204813
C  1.94596 0.973057 0.115142
C  2.306516 -1.45314 -0.113395
C  2.802002 -0.141741 0.055007
H  -2.119629 0.405309 1.347512
H  -1.681384 1.578963 -1.488912
H  -2.240917 2.526645 -0.053106
H  -3.679791 -0.071093 -1.283581
H  -4.332597 0.758751 0.17957
H  0.492198 -2.649919 -0.321784
H  2.324081 1.99176 0.230452
H  2.986478 -2.306953 -0.16412
H  -3.373301 -1.947704 0.235979
