program: Gaussian 09
title: 000233951
version: EM64L-G09RevD.01
frameworkgroup: C1[X(C15H20N2O3)]
method: RPBEPBE
basis: SDD
operation: Freq
keyword: #p
keyword: freq=noraman
keyword: PBEPBE/SDD
title: #p freq=noraman PBEPBE/SDD
converged: YES YES NO NO
title: Mulliken charges:
elementType: O O O N N C C C C C C C C C C C C C C C H H H H H H H H H H H H H H H H H H H H
charge: -0.291263 -0.433964 -0.222264 -0.183310 -0.388567 -0.209938 -0.446099 -0.587844 0.306302 0.287663 0.194853 -0.377786 -0.407551 -0.388052 -0.680064 -0.116277 -0.277276 -0.249715 -0.673230 0.160218 0.240903 0.246346 0.222597 0.241502 0.233507 0.220975 0.220624 0.227863 0.229149 0.381263 0.237765 0.216933 0.225215 0.286161 0.225229 0.220191 0.239957 0.260661 0.217722 0.389599
chargesum: 0.00000
title: Mulliken charges with hydrogens summed into heavy atoms:
elementType: O O O N N C C C C C C C C C C C C C C C
charge: -0.291263 -0.044365 -0.222264 -0.183310 -0.007304 0.030965 0.022844 -0.112835 0.306302 0.287663 0.194853 0.063813 -0.179688 -0.158903 -0.000150 0.169884 -0.052047 -0.029525 0.045111 0.160218
polarizability: 1.68614476e+02 1.15866623e+01 2.10591095e+02 1.02038509e+01 -1.54884701e+00 1.57800520e+02
1716.lowfreq: -3.4274 -0.0006 0.0004 0.0006 8.0799 13.5548 19.3316 29.9589 35.2266
frequency: 19.2030 29.8973 35.2112 44.4308 65.8970 72.8883 88.9272 96.6629 119.5620 176.8164 208.8836 217.0150 221.6987 244.0932 269.3631 291.3364 304.0612 324.8731 341.2750 378.1547 404.8426 440.8434 450.5230 479.4694 491.3681 526.9785 537.3841 541.3740 558.5514 589.4187 605.5908 635.5015 667.5903 689.6863 702.6638 716.2369 749.2077 775.2170 779.3987 789.8671 828.9089 839.1274 876.0322 902.3460 913.0801 923.4668 937.5599 954.4591 965.9585 988.4095 1008.9582 1040.5415 1050.8391 1066.3558 1077.4963 1086.5707 1104.8828 1107.3715 1141.0688 1151.2447 1170.9716 1182.3834 1193.5263 1210.2719 1235.4171 1241.9593 1254.7484 1274.2612 1280.2317 1284.6447 1300.3728 1321.7350 1336.7918 1341.4424 1345.5035 1353.0295 1377.1053 1381.5423 1385.2774 1393.3262 1449.4854 1463.1973 1466.4334 1469.4941 1477.6267 1479.1195 1482.0001 1495.2408 1501.1534 1511.4013 1577.3923 1591.3437 1617.6395 1672.0858 2927.1660 2969.5267 2983.3344 2991.3035 2998.9503 3019.8673 3026.5946 3032.1585 3040.9543 3051.9700 3079.4662 3089.9004 3105.2510 3109.1309 3116.5697 3127.0557 3155.7274 3169.0361 3505.8400 3524.0913
redmass: 4.9072 4.3524 6.4283 5.1952 5.0044 4.8454 2.8855 4.5618 4.3027 4.6264 1.1929 2.9297 2.8841 1.1523 3.1490 3.4116 3.6811 3.0708 3.2456 3.1577 3.4756 3.0626 3.3120 4.9839 4.5080 3.7863 3.5182 3.6005 4.8101 3.3089 1.3555 1.3305 3.4699 4.2489 3.4037 2.5387 1.5073 3.7063 1.4273 2.9695 3.2461 1.3984 3.4191 1.7748 2.2888 2.5250 1.4827 2.4684 1.3154 2.5577 2.0274 2.4325 2.1657 2.2308 2.2735 1.8436 2.0074 2.0112 1.5577 2.0642 1.2716 1.2489 1.6221 1.7408 2.3307 1.6040 1.2778 1.9069 1.2966 1.5296 1.9869 1.4543 1.6220 1.5382 1.2850 1.5548 1.1992 5.6912 1.2212 1.6885 2.1343 1.2832 1.1016 1.0524 1.0619 1.0539 1.1219 1.2238 1.8977 1.9446 6.5403 7.2217 6.3183 9.0780 1.0699 1.0642 1.0354 1.0608 1.0346 1.0821 1.0973 1.0847 1.1022 1.0920 1.0993 1.1013 1.1014 1.0882 1.1016 1.0876 1.0937 1.0970 1.0788 1.0643
irintensity: 0.8827 0.7716 0.9828 1.1058 6.8624 3.8788 1.2916 0.9338 0.4285 3.9265 1.7498 1.4279 7.2880 0.5607 0.2168 0.9798 4.1150 4.3812 2.0888 4.5683 11.0884 6.4097 4.1583 13.6254 1.1281 18.9526 13.6663 4.7999 5.7680 15.5933 101.9175 86.6112 1.5235 5.0187 50.1447 5.7605 94.6035 1.9013 7.9964 9.2583 1.5270 2.0335 10.8640 6.9045 8.5858 4.6377 11.6377 22.3513 0.1149 7.1508 112.6928 10.7598 9.5571 7.8787 7.5574 12.8603 55.5975 25.3885 7.4831 24.0650 7.3714 8.4813 42.9601 12.6235 19.4613 33.6649 16.7852 19.8288 10.9361 10.1555 33.1294 0.8484 5.9018 46.0848 18.3492 40.9531 25.9998 11.3194 25.3091 6.2870 25.7701 3.1038 48.6674 12.0463 16.7096 3.5129 8.4078 12.7054 253.4367 131.3094 10.2630 191.8094 94.6391 248.3479 80.6146 34.4923 30.6813 39.3275 13.3461 11.3359 23.0863 24.5205 5.8233 17.1464 43.5459 39.9503 21.7598 13.4506 9.3232 11.7279 33.2896 18.7916 82.7858 28.7701
temp: 298.150 k
press: 1.00000 atm
elementType: 8 8 8 7 7 6 6 6 6 6 6 6 6 6 6 6 6 6 6 6 1 1 1 1 1 1 1 1 1 1 1 1 1 1 1 1 1 1 1 1
symmnumber: 1
zpe: 866028.7 jmol-1
zpe.correction: 0.329853 hartree
zpe.thermalcorrener: 0.349524 hartree
zpe.thermalcorrenthalpy: 0.350468 hartree
zpe.thermalcorrgfe: 0.279704 hartree
zpe.sumelectzpe: -917.295057 hartree
zpe.sumelectthermal: -917.275387 hartree
zpe.sumelectthermalent: -917.274442 hartree
zpe.sumelectthermalfe: -917.345207 hartree
dipole: -2.7478 2.0075 0.2718
dipole: 3.4138
quadrupole: -127.7843 -121.3988 -111.2876
quadrupole: 13.8970 6.3553 2.9578
quadrupole: -7.6274 -1.2419 8.8694 13.8970 6.3553 2.9578
hfenergy: -917.6249103 hartree
pointgroup: C01 [X(C15H20N2O3)]
dipole: 1.2928033 0.2451948 -0.2692286 debye
polarizability: 162.0569245|4.0154906|173.4301576|-16.8166129|17.5181168|201.5190095 unknown
InChI: InChI=1S/C15H20N2O3/c1-3-17-9-12(14(18)16-10(2)15(19)20)8-11-6-4-5-7-13(11)17/h4-7,10,12,16,19H,3,8-9H2,1-2H3
charge 0 multiplicity 1
40 atoms
O  -2.267088 -0.58278 2.375307
O  -1.898954 -2.137206 -2.154413
O  -4.19828 -1.812374 -2.226254
N  0.907772 1.188088 1.360905
N  -1.570573 -1.045605 0.212607
C  0.109402 -1.07067 2.063039
C  0.675565 0.299231 2.515546
C  1.114863 -1.715214 1.083166
C  1.546246 -0.753889 -0.021688
C  1.454906 0.669324 0.174169
C  -1.334393 -0.879937 1.559265
C  0.813867 2.638674 1.601253
C  2.042779 -1.256726 -1.243724
C  1.900311 1.52315 -0.882507
C  2.124627 3.283544 2.116708
C  -2.924157 -0.885368 -0.332119
C  2.472638 -0.405926 -2.286661
C  2.395532 0.991228 -2.08958
C  -3.306865 0.606972 -0.554232
C  -3.110578 -1.653236 -1.635752
H  0.014418 -1.699964 2.967539
H  -0.050539 0.784011 3.191547
H  1.612708 0.123324 3.089077
H  0.702322 -2.644817 0.646956
H  2.003254 -2.024475 1.670345
H  0.483972 3.140333 0.672424
H  0.009043 2.801462 2.342304
H  2.092904 -2.345626 -1.37592
H  1.869566 2.609778 -0.763282
H  -0.799097 -1.205553 -0.44181
H  2.950151 3.137816 1.397997
H  1.986954 4.369961 2.270824
H  2.42942 2.838782 3.081048
H  -3.635032 -1.299944 0.407922
H  2.858982 -0.820909 -3.222986
H  2.728468 1.677448 -2.877112
H  -4.335991 0.682685 -0.944116
H  -3.248063 1.12697 0.41549
H  -2.613152 1.087445 -1.266142
H  -2.065207 -2.591512 -3.023839
