program: Gaussian 09
title: 000233950
version: EM64L-G09RevD.01
frameworkgroup: C1[X(C11H19N3O2)]
method: RPBEPBE
basis: SDD
operation: Freq
keyword: #p
keyword: freq=noraman
keyword: PBEPBE/SDD
title: #p freq=noraman PBEPBE/SDD
converged: YES YES NO NO
title: Mulliken charges:
elementType: O O N N N C C C C C C C C C C C H H H H H H H H H H H H H H H H H H H
charge: -0.225735 -0.225027 -0.404401 -0.043263 -0.379624 0.074191 -0.482410 -0.041690 -0.398626 0.135499 0.002040 -0.701668 -0.697188 -0.715401 0.217776 -0.609965 0.246673 0.216407 0.189698 0.244577 0.207225 0.204519 0.234072 0.206860 0.213351 0.201705 0.240102 0.223643 0.269105 0.207891 0.319402 0.304747 0.229357 0.306351 0.229805
chargesum: 0.00000
title: Mulliken charges with hydrogens summed into heavy atoms:
elementType: O O N N N C C C C C C C C C C C
charge: -0.225735 -0.225027 -0.084998 -0.043263 -0.074877 0.074191 -0.019330 0.148008 0.053176 0.135499 0.002040 -0.056217 -0.042030 -0.014761 0.217776 0.155548
polarizability: 1.80072692e+02 1.15481877e+01 1.30299478e+02 -2.24810494e+00 -8.77554175e+00 1.35573393e+02
1716.lowfreq: -3.8524 -3.3588 -0.0006 -0.0001 0.0005 15.3636 30.0355 35.8599 90.3385
frequency: 29.9951 35.7134 90.3317 97.3642 107.6837 127.9919 146.5870 158.2466 174.7830 191.0548 206.5467 209.7498 231.6228 249.5141 261.6521 267.9606 279.4312 338.3068 360.0706 368.5935 377.3167 434.4993 450.3100 479.8817 488.2512 541.1201 599.5218 630.7527 657.0814 688.7144 712.1777 720.5659 733.4018 775.7065 798.0168 836.1431 911.4145 917.9781 948.0533 960.6127 972.6738 986.3722 1006.8628 1051.5123 1072.1624 1086.3989 1096.1763 1107.4376 1127.1706 1145.5245 1168.1008 1203.7824 1212.5385 1250.2268 1265.2954 1280.3448 1294.0949 1315.2321 1325.8457 1343.5825 1361.4914 1381.6810 1394.4323 1399.3101 1411.7766 1418.9563 1444.0804 1458.5375 1464.7125 1466.4959 1471.1543 1476.4239 1478.8779 1489.9329 1492.1860 1492.7835 1536.7127 1556.4514 1633.2544 1636.7264 2947.2513 2970.6776 2971.5946 2975.8085 2984.5585 2989.6128 2996.5899 3035.7600 3054.5812 3062.6883 3065.0420 3068.8188 3077.4271 3081.2167 3088.2701 3104.0705 3117.5030 3490.1237 3562.7281
redmass: 3.6742 3.0460 2.5408 2.5220 1.1972 3.1564 3.2354 5.7345 3.9481 3.0410 3.4827 2.7182 1.7192 1.2278 1.7973 2.0038 1.4195 3.6826 5.7526 2.0458 2.0331 4.3320 1.1860 4.5263 9.5034 2.8493 6.8461 1.7365 3.3639 8.0104 4.1013 3.6693 3.4535 1.8107 2.1403 1.9850 1.2459 3.2161 1.9751 1.6187 3.4440 2.4460 1.9365 3.4557 2.5217 1.9980 1.5813 2.1442 1.2787 2.6200 2.3465 2.0637 3.4953 1.8646 1.2473 3.2052 1.3800 1.5127 1.3653 1.4540 1.3104 1.2076 1.2135 1.2088 1.8563 1.1899 1.0840 1.0570 1.1688 1.0888 1.0506 1.0596 1.0551 1.0540 1.0457 1.0522 1.8552 6.9785 6.1426 7.0485 1.0824 1.0366 1.0596 1.0364 1.0345 1.0374 1.0619 1.1004 1.0991 1.0985 1.1004 1.1029 1.0982 1.0998 1.0991 1.1003 1.0992 1.0769 1.0775
irintensity: 2.5549 2.8513 0.6806 1.3342 1.2365 1.3514 2.0649 5.3601 0.1247 0.5747 8.6944 0.2282 2.2227 0.3024 1.7029 2.3666 1.2646 7.6433 5.1177 1.1395 0.5696 1.0892 47.0502 12.2629 3.3602 5.8637 0.9761 100.7332 30.7709 0.3030 25.2786 24.1007 31.7618 14.0666 8.6755 1.3557 1.7571 1.3301 4.9544 2.1813 22.1981 7.9176 3.9207 32.2496 9.4883 14.1212 4.5006 19.3932 0.0518 5.0807 13.1008 5.1659 67.3201 221.1438 1.5663 103.0170 17.4599 25.8132 1.6757 0.8211 5.9087 21.7856 61.9023 17.5621 31.2716 72.5899 13.7269 16.8330 61.2888 12.6223 20.8155 21.6556 30.2662 7.0793 13.4880 17.3674 129.9192 678.0396 329.9661 165.2778 21.3040 19.0948 27.1464 32.3986 84.4868 28.3211 29.4855 10.2136 8.0971 126.8233 5.8676 28.6622 35.9002 24.2523 24.7429 19.6317 0.0025 16.1276 56.5334
temp: 298.150 k
press: 1.00000 atm
elementType: 8 8 7 7 7 6 6 6 6 6 6 6 6 6 6 6 1 1 1 1 1 1 1 1 1 1 1 1 1 1 1 1 1 1 1
symmnumber: 1
zpe: 771689.2 jmol-1
zpe.correction: 0.293921 hartree
zpe.thermalcorrener: 0.311754 hartree
zpe.thermalcorrenthalpy: 0.312699 hartree
zpe.thermalcorrgfe: 0.248744 hartree
zpe.sumelectzpe: -744.037086 hartree
zpe.sumelectthermal: -744.019252 hartree
zpe.sumelectthermalent: -744.018308 hartree
zpe.sumelectthermalfe: -744.082263 hartree
dipole: -4.6536 -1.8453 3.0227
dipole: 5.8479
quadrupole: -74.9597 -96.9942 -110.1789
quadrupole: 5.5157 -9.6544 5.2203
quadrupole: 19.0845 -2.9499 -16.1346 5.5157 -9.6544 5.2203
hfenergy: -744.3310064 hartree
pointgroup: C01 [X(C11H19N3O2)]
dipole: -1.7506817 -1.3267976 0.684236 debye
polarizability: 176.1498427|16.5728199|140.4368557|6.9745493|-6.4623528|129.3588653 unknown
InChI: InChI=1S/C11H19N3O2/c1-5-11(6-7(2)3)8(15)13-10(12-4)14-9(11)16/h7,12-13H,5-6H2,1-4H3
charge 0 multiplicity 1
35 atoms
O  0.724892 -1.238269 2.229594
O  0.168499 2.009838 -1.358549
N  -1.230475 -0.998643 1.032364
N  -1.591908 0.659552 -0.688494
N  -3.31485 -0.796551 -0.042851
C  0.665924 0.567461 0.545187
C  2.091423 0.234983 -0.00856
C  2.284261 -0.919253 -1.04058
C  0.784866 1.702217 1.66101
C  0.098426 -0.627205 1.323397
C  -0.264132 1.115796 -0.578582
C  1.989974 -2.337264 -0.490324
C  1.550871 -0.699963 -2.386876
C  1.497026 3.002292 1.240461
C  -2.023038 -0.336123 0.072794
C  -4.270701 -0.223945 -1.00137
H  2.452687 1.166034 -0.480389
H  2.733438 0.026761 0.869769
H  3.37367 -0.886558 -1.26153
H  1.318205 1.239837 2.513621
H  -0.238832 1.944737 2.013089
H  0.903774 -2.51349 -0.373766
H  2.463667 -2.504398 0.49317
H  2.366875 -3.101089 -1.196558
H  0.455398 -0.81075 -2.280733
H  1.887256 -1.450322 -3.127307
H  1.738881 0.308191 -2.794932
H  2.567597 2.833708 1.031353
H  1.040003 3.446432 0.340963
H  1.430682 3.733599 2.067625
H  -1.599996 -1.775841 1.590099
H  -3.628285 -1.55916 0.558519
H  -4.629454 -0.995186 -1.706725
H  -3.73989 0.562614 -1.559337
H  -5.135935 0.221957 -0.477854
