program: Gaussian 09
title: 000233947
version: EM64L-G09RevD.01
frameworkgroup: C1[X(C10H20N2O2)]
method: RPBEPBE
basis: SDD
operation: Freq
keyword: #p
keyword: freq=noraman
keyword: PBEPBE/SDD
title: #p freq=noraman PBEPBE/SDD
converged: YES YES NO NO
title: Mulliken charges:
elementType: O O N N C C C C C C C C C C H H H H H H H H H H H H H H H H H H H H
charge: -0.316619 -0.449786 -0.281697 -0.371380 -0.229789 -0.404163 -0.380837 -0.415691 -0.445964 0.246267 -0.107580 -0.417179 -0.273537 -0.675204 0.245813 0.225753 0.167003 0.222461 0.205516 0.208578 0.206504 0.207586 0.226704 0.264647 0.246633 0.293114 0.195832 0.214619 0.182488 0.185573 0.214405 0.221254 0.220702 0.367976
chargesum: 0.00000
title: Mulliken charges with hydrogens summed into heavy atoms:
elementType: O O N N C C C C C C C C C C
charge: -0.316619 -0.081810 -0.017050 -0.078267 0.016023 -0.011407 0.047140 -0.000610 -0.011674 0.246267 0.139053 -0.006728 0.094524 -0.018843
polarizability: 1.45235061e+02 1.02311116e+00 1.14958181e+02 -6.95433862e+00 -1.66271770e+00 1.14162197e+02
1716.lowfreq: -17.0429 -1.4355 -0.0008 -0.0008 -0.0006 9.1104 24.7442 38.7536 80.3904
frequency: 18.9940 38.7259 80.3850 97.0665 106.3828 125.3539 137.7467 181.0294 199.8670 225.4853 273.5001 302.0356 326.6826 349.0542 383.3330 400.4129 429.7557 454.1804 475.0376 521.6852 541.0867 558.7264 563.4374 601.9914 678.8700 769.0165 773.3275 808.8257 811.9663 864.4903 878.4768 893.1713 912.7997 936.0897 969.4144 997.9492 1011.9100 1032.5173 1049.6274 1065.2745 1086.8478 1088.6781 1093.8603 1122.8160 1126.4590 1153.5694 1177.0178 1188.9293 1204.8440 1217.4092 1223.4172 1258.9300 1275.6073 1283.5291 1287.3778 1312.7638 1324.9641 1330.7050 1335.1444 1342.3714 1353.7922 1372.6624 1392.1202 1396.7855 1409.7702 1439.4211 1446.8827 1456.6263 1466.9019 1472.8287 1474.6786 1475.6369 1483.7549 1485.2823 1489.1122 1567.4538 2863.7706 2908.3083 2937.9497 2960.2704 2964.4172 2982.5855 2984.6470 2997.3962 3006.9831 3022.0461 3031.9312 3033.3060 3038.1316 3047.4396 3078.9225 3079.5961 3081.7372 3384.6834 3445.8734 3544.9882
redmass: 3.6809 5.3426 2.3912 3.8403 3.2990 2.4817 3.0179 2.1983 2.6802 1.7344 2.8807 3.2800 4.2792 2.0909 2.7936 2.5319 2.8674 2.9571 2.8644 2.0085 1.6065 1.4101 1.6012 2.2917 1.8317 3.5109 1.2307 2.0247 2.3676 2.4832 2.5070 2.4192 2.2748 2.1149 3.1930 1.6419 1.4650 2.3129 3.6882 1.7193 1.6971 2.1403 1.8500 2.5762 2.2189 2.2305 1.4598 1.3006 1.2026 1.5472 1.2088 1.2920 1.2295 1.5561 1.2280 1.5456 1.2540 1.3451 1.3634 1.5889 1.4073 1.2373 1.4269 1.2064 1.1942 1.1315 1.2903 1.5059 1.0996 1.0951 1.0676 1.0674 1.0948 1.0987 1.2980 5.8265 1.0709 1.0692 1.0654 1.0790 1.0654 1.0362 1.0655 1.0840 1.0647 1.0950 1.0891 1.0975 1.0910 1.0978 1.1002 1.1011 1.0996 1.0679 1.0750 1.0769
irintensity: 1.6324 5.0973 2.9001 3.3506 9.4247 8.2415 4.7937 1.2941 2.1571 2.8380 2.2179 1.5513 18.1409 0.2401 8.2220 3.3032 0.3157 30.1836 42.5223 9.6569 120.4380 79.3727 163.9863 18.9183 88.4512 1.8038 7.0885 1.1766 0.8887 5.2603 3.1430 3.4653 15.5289 5.1119 39.7712 1.5370 1.7342 21.3545 22.0327 2.3262 8.2514 2.2924 9.4487 4.6286 13.6867 6.6599 20.5789 5.8216 2.6919 15.2205 2.5188 31.5023 19.0671 0.2800 1.4324 3.7051 22.0713 10.7859 1.4164 7.1030 0.6137 2.3160 0.5682 16.0410 38.7192 11.6093 3.7542 181.6813 6.9390 30.8741 3.8562 8.9947 56.6948 11.3298 61.8965 111.4480 73.6346 63.1229 97.2271 11.7944 36.9898 26.7319 68.8596 1.8472 35.0012 28.3729 64.5819 51.4303 39.0515 58.5070 52.1360 24.2468 44.2234 122.6047 1.4109 10.9262
temp: 298.150 k
press: 1.00000 atm
elementType: 8 8 7 7 6 6 6 6 6 6 6 6 6 6 1 1 1 1 1 1 1 1 1 1 1 1 1 1 1 1 1 1 1 1
symmnumber: 1
zpe: 782714.3 jmol-1
zpe.correction: 0.298120 hartree
zpe.thermalcorrener: 0.313296 hartree
zpe.thermalcorrenthalpy: 0.314240 hartree
zpe.thermalcorrgfe: 0.254999 hartree
zpe.sumelectzpe: -651.871261 hartree
zpe.sumelectthermal: -651.856085 hartree
zpe.sumelectthermalent: -651.855141 hartree
zpe.sumelectthermalfe: -651.914382 hartree
dipole: -2.1070 -3.0316 2.2453
dipole: 4.3211
quadrupole: -79.2237 -92.2034 -87.4366
quadrupole: 4.4377 -1.5969 -0.0324
quadrupole: 7.0642 -5.9155 -1.1487 4.4377 -1.5969 -0.0324
hfenergy: -652.1693813 hartree
pointgroup: C01 [X(C10H20N2O2)]
dipole: 0.892882 -0.1759951 1.4359485 debye
polarizability: 146.3270584|1.1336401|112.044803|3.5726988|-0.1164901|115.983577 unknown
InChI: InChI=1S/C10H20N2O2/c1-2-9(7-13)12-10(14)8-3-5-11-6-4-8/h8-9,11-13H,2-7H2,1H3
charge 0 multiplicity 1
34 atoms
O  -0.431084 1.642474 -1.192714
O  1.059438 -0.404949 -2.464492
N  -3.300335 -1.274335 -0.191899
N  0.912918 0.511871 0.309644
C  -1.497977 0.782965 0.875622
C  -1.577065 -0.663127 1.452221
C  -2.843699 1.134619 0.188151
C  -1.98477 -1.674657 0.35883
C  -3.259201 0.061205 -0.841301
C  -0.313518 0.999241 -0.0921
C  2.14413 0.720014 -0.487725
C  3.389808 0.687921 0.42651
C  2.263741 -0.308396 -1.643277
C  3.451187 1.856333 1.433611
H  -1.337275 1.489113 1.718039
H  -2.354954 -0.674289 2.238515
H  -0.63001 -0.981262 1.932923
H  -2.758518 2.111485 -0.318195
H  -3.625358 1.204116 0.968191
H  -1.182443 -1.715076 -0.421172
H  -2.076426 -2.683892 0.80091
H  -4.268066 0.293703 -1.228787
H  -2.548002 0.098536 -1.699706
H  -3.688423 -1.992667 -0.817284
H  2.041428 1.726401 -0.940785
H  0.969033 -0.073412 1.144943
H  3.423022 -0.283176 0.964766
H  4.288774 0.709172 -0.219447
H  3.137496 -0.017968 -2.268194
H  2.449494 -1.322908 -1.239919
H  2.565213 1.86931 2.094172
H  3.486614 2.827793 0.907145
H  4.349884 1.783098 2.072103
H  0.556545 0.457449 -2.402002
