program: Gaussian 09
title: 000233944
version: EM64L-G09RevD.01
frameworkgroup: C1[X(C14H17N3O2)]
method: RPBEPBE
basis: SDD
operation: Freq
keyword: #p
keyword: freq=noraman
keyword: PBEPBE/SDD
title: #p freq=noraman PBEPBE/SDD
converged: YES YES NO NO
title: Mulliken charges:
elementType: O O N N N C C C C C C C C C C C C C C H H H H H H H H H H H H H H H H H
charge: -0.231856 -0.212414 -0.414692 -0.040602 -0.137233 -0.053244 -0.379752 0.405444 0.129705 -0.077552 -0.729103 0.280800 -0.373850 -0.390146 -0.241188 -0.241040 -0.244010 -0.660383 -0.633892 0.222023 0.234494 0.228433 0.246906 0.215578 0.346517 0.272395 0.273809 0.227684 0.226323 0.228886 0.249229 0.244000 0.253573 0.228578 0.313522 0.233057
chargesum: 0.00000
title: Mulliken charges with hydrogens summed into heavy atoms:
elementType: O O N N N C C C C C C C C C C C C C C
charge: -0.231856 -0.212414 -0.068175 -0.040602 -0.137233 -0.053244 0.076765 0.405444 0.129705 -0.077552 -0.038186 0.280800 -0.101456 -0.116337 -0.013504 -0.014717 -0.015124 0.086420 0.141266
polarizability: 1.96342276e+02 -1.91488763e+00 1.70386957e+02 5.71936470e-01 2.15035765e+00 1.68494525e+02
1716.lowfreq: -7.7503 -3.0115 -0.0005 0.0003 0.0005 6.4923 25.4425 34.1375 67.6619
frequency: 25.3576 33.9663 67.6573 88.8871 106.1599 113.7937 115.4963 136.6457 155.9559 161.0572 182.0735 196.7820 216.0574 222.7852 272.0144 281.3970 306.6792 321.5840 331.1498 385.5437 402.9913 426.8274 452.7253 492.9992 510.2776 547.2758 582.4047 611.8840 628.5202 661.0942 676.0680 692.9368 704.4616 707.1624 725.7932 762.3909 768.0556 858.7379 883.0438 902.9121 928.2479 932.1305 959.3835 985.1958 988.9977 998.7418 1006.1747 1030.5682 1060.7127 1081.0884 1089.3015 1092.9821 1111.8224 1133.9335 1139.5098 1154.1883 1158.4595 1174.2312 1182.3992 1205.5337 1256.1520 1280.0870 1297.4114 1330.4598 1335.6450 1357.0432 1375.2785 1386.2250 1415.8643 1433.8767 1436.7619 1445.9987 1449.5669 1473.0536 1480.8233 1482.9480 1486.9776 1487.3650 1494.6922 1497.9772 1560.2195 1588.0457 1605.2396 1622.1619 1634.2971 2957.8424 2978.0795 2987.2250 3017.1175 3045.4456 3060.1029 3070.5943 3080.1627 3098.4910 3107.5850 3122.7739 3123.6418 3131.5544 3143.2063 3153.4839 3165.1357 3516.0925
redmass: 4.6114 3.8718 2.5800 2.8538 1.3814 2.5367 2.4881 6.7710 1.5153 3.8708 3.8066 1.9186 3.6298 2.3515 3.6339 2.3095 3.3693 4.1259 4.5821 4.0407 2.8703 4.5812 4.1118 9.1628 3.5261 4.7312 3.5820 5.4212 2.1523 3.0457 5.8089 6.9501 4.6690 2.2602 3.6910 1.4774 1.7807 1.2442 4.3772 5.9000 1.5233 2.3730 2.2648 1.3761 5.9284 1.3527 2.7871 2.4447 1.5002 2.9110 1.6470 1.2381 2.6779 2.2483 1.5112 3.3011 2.5986 1.0599 2.5763 1.1334 4.9882 4.8248 1.2329 1.3659 1.3634 2.2020 6.2688 1.2128 1.1525 2.2486 1.5339 1.0933 1.5498 1.1978 1.9811 1.0504 1.0789 1.0562 1.0906 1.2194 7.2688 5.9203 5.8085 5.1486 9.0851 1.0413 1.0353 1.0354 1.0604 1.0965 1.1025 1.1009 1.0984 1.1025 1.0973 1.0848 1.0987 1.0881 1.0931 1.0954 1.1010 1.0766
irintensity: 3.2024 0.6975 0.1292 0.5875 3.5301 0.4654 0.7123 0.3922 0.5741 0.9549 5.2882 2.9120 1.4598 2.3030 8.3580 1.0061 1.5324 3.6969 7.6238 2.6973 0.0203 4.3169 5.2046 2.9609 10.9556 23.1273 11.4935 4.9003 49.0348 14.1991 3.2398 3.7717 8.7315 39.4683 26.5166 12.4434 44.5247 0.3843 26.5065 6.7785 7.1243 1.7965 20.2040 0.2175 4.4381 4.0707 62.9563 15.9609 39.0531 5.2458 12.1360 2.9968 19.6140 3.5624 5.2378 6.3477 0.8665 0.2393 39.5673 6.5850 85.2553 260.0409 10.0005 6.2152 8.6242 8.6700 0.9048 23.3804 36.2389 22.5817 55.0506 25.0452 63.4306 49.8683 26.0371 24.8398 22.7398 19.0061 4.7822 24.9841 795.6054 14.1255 17.5616 473.9082 106.2081 51.0503 81.0772 35.0644 17.0770 21.7197 28.5584 5.9432 33.0969 20.7273 11.4519 0.4633 0.3480 6.7902 13.1601 17.5680 25.1691 23.2857
temp: 298.150 k
press: 1.00000 atm
elementType: 8 8 7 7 7 6 6 6 6 6 6 6 6 6 6 6 6 6 6 1 1 1 1 1 1 1 1 1 1 1 1 1 1 1 1 1
symmnumber: 1
zpe: 760262.2 jmol-1
zpe.correction: 0.289569 hartree
zpe.thermalcorrener: 0.308159 hartree
zpe.thermalcorrenthalpy: 0.309104 hartree
zpe.thermalcorrgfe: 0.242479 hartree
zpe.sumelectzpe: -857.008691 hartree
zpe.sumelectthermal: -856.990100 hartree
zpe.sumelectthermalent: -856.989156 hartree
zpe.sumelectthermalfe: -857.055781 hartree
dipole: 4.6378 -4.4756 3.4769
dipole: 7.3232
quadrupole: -88.3182 -110.3951 -122.2531
quadrupole: -3.7206 7.0038 1.1329
quadrupole: 18.6706 -3.4063 -15.2643 -3.7206 7.0038 1.1329
hfenergy: -857.2982594 hartree
pointgroup: C01 [X(C14H17N3O2)]
dipole: 1.5505827 1.839769 -1.5849486 debye
polarizability: 195.4128858|4.8821737|171.5348658|-2.1640973|1.6411843|168.2760064 unknown
InChI: InChI=1S/C14H17N3O2/c1-4-14(10-8-6-5-7-9-10)11(18)15-13(17(2)3)16-12(14)19/h5-9,15H,4H2,1-3H3
charge 0 multiplicity 1
36 atoms
O  0.015921 -1.690583 -2.202895
O  0.286504 -1.193668 2.503359
N  1.514163 -0.236674 -1.224833
N  1.630295 0.131586 1.152013
N  3.082827 1.280566 -0.298573
C  -0.410788 -1.024422 0.153148
C  -1.171674 -2.37103 0.358202
C  -1.455324 0.135802 0.056578
C  0.361824 -1.047636 -1.176025
C  0.548194 -0.730908 1.35838
C  -0.263023 -3.614388 0.444873
C  2.053568 0.390818 -0.082726
C  -1.740882 0.963529 1.172356
C  -2.203362 0.31215 -1.137502
C  -2.743837 1.955719 1.088139
C  -3.20354 1.305456 -1.218097
C  -3.477769 2.133883 -0.105881
C  3.541051 1.647498 -1.649657
C  3.775536 1.887143 0.854976
H  -1.885065 -2.483376 -0.478173
H  -1.753889 -2.268317 1.290641
H  0.312537 -3.760781 -0.486717
H  0.435122 -3.537288 1.296223
H  -0.879282 -4.518737 0.598947
H  1.995082 -0.214592 -2.128202
H  -1.192828 0.829463 2.110452
H  -2.007787 -0.330525 -2.003478
H  -2.952525 2.585694 1.960203
H  -3.770929 1.4277 -2.147746
H  -4.254819 2.904047 -0.167679
H  2.690569 1.886453 -2.314278
H  4.160982 0.855253 -2.117184
H  4.162297 2.553111 -1.572584
H  4.860272 1.679663 0.800834
H  3.355253 1.448432 1.771634
H  3.616323 2.981461 0.869075
