program: Gaussian 09
title: 000233939
version: EM64L-G09RevD.01
frameworkgroup: C1[X(C20H16N2O4)]
method: RPBEPBE
basis: SDD
operation: Freq
keyword: #p
keyword: freq=noraman
keyword: PBEPBE/SDD
title: #p freq=noraman PBEPBE/SDD
converged: YES YES NO YES
title: Mulliken charges:
elementType: O O O O N N C C C C C C C C C C C C C C C C C C C C H H H H H H H H H H H H H H H H
charge: -0.316070 -0.316071 -0.265185 -0.265184 -0.453001 -0.453001 0.004379 0.004378 0.321459 0.321458 0.500768 0.500768 0.271533 0.271534 -0.463910 -0.463908 -0.497830 -0.497830 -0.497701 -0.497702 -0.408104 -0.408103 0.260017 0.260017 -0.492132 -0.492132 0.190508 0.190508 0.243527 0.243527 0.243524 0.243524 0.298867 0.298866 0.339938 0.339938 0.233345 0.243037 0.243031 0.233345 0.243033 0.243034
chargesum: 0.00000
title: Mulliken charges with hydrogens summed into heavy atoms:
elementType: O O O O N N C C C C C C C C C C C C C C C C C C C C
charge: -0.316070 -0.316071 -0.265185 -0.265184 -0.113063 -0.113063 0.004379 0.004378 0.321459 0.321458 0.500768 0.500768 0.271533 0.271534 -0.273402 -0.273400 -0.254303 -0.254303 -0.254178 -0.254178 -0.109237 -0.109237 0.260017 0.260017 0.227281 0.227281
polarizability: 4.98672982e+02 1.51740888e-05 3.08697148e+02 -2.04992030e-02 1.14891757e-04 1.02962692e+02
1716.lowfreq: -7.1706 -3.7573 -0.0008 -0.0006 0.0007 5.8163 30.8706 33.7709 34.2919
frequency: 30.8706 33.7630 34.2918 42.2850 63.6493 75.7100 77.1315 83.8868 104.8379 106.9826 136.9925 166.2469 175.7218 187.6240 214.8251 244.1326 247.2313 259.8760 264.2146 281.0443 327.3199 343.9807 371.5938 420.3694 434.1170 451.6004 473.2426 501.0770 512.4542 515.9619 542.1851 555.4897 565.6874 596.6109 622.3879 630.6057 636.4948 661.4887 680.9864 686.3457 692.6267 696.0003 707.7727 729.7933 740.2649 753.1538 797.7419 800.0001 816.5380 835.5719 848.7210 862.9707 885.8532 892.4401 902.5200 912.9633 930.6131 971.1494 988.0234 992.7717 995.7600 1024.6641 1063.0254 1112.1874 1120.2364 1120.2427 1126.0011 1144.1687 1145.7975 1160.8989 1168.2863 1168.9066 1198.8831 1201.8921 1219.4234 1246.2686 1252.2055 1298.1097 1305.5748 1336.9470 1360.0343 1382.6393 1406.0075 1421.1502 1425.6833 1426.7237 1430.4368 1431.2069 1452.5297 1452.5481 1467.0754 1468.9003 1474.8390 1481.7296 1505.7889 1516.9666 1533.2275 1564.2628 1597.3293 1612.6955 1614.0898 1631.6278 1671.6237 1673.9199 3002.0781 3002.1784 3102.6820 3102.6979 3105.0280 3122.5547 3131.3658 3135.0073 3135.0284 3145.0530 3145.0716 3147.2672 3186.7206 3186.8921 3561.8335 3562.1696
redmass: 5.2106 5.1953 4.5099 4.3854 5.0670 1.3887 1.2554 2.7321 3.4932 4.6464 3.5961 4.0652 3.9268 5.9844 4.1757 6.9084 6.4172 4.6872 5.2284 4.6157 5.3219 6.5991 4.2402 7.3633 5.8351 3.4965 5.9703 3.5043 5.2583 3.4221 5.8392 6.8499 2.3891 7.0091 1.5067 1.7333 3.6330 6.1474 6.2232 7.0913 5.6172 5.6421 3.7911 1.9553 5.2568 6.6833 1.4782 4.6217 2.0677 3.4659 6.8674 1.7615 1.5895 5.8892 7.1818 6.7089 1.4382 1.3235 1.3517 1.3952 5.2256 9.0848 4.0607 2.4874 1.2545 1.2545 3.1365 1.6695 1.6511 1.3084 2.3046 2.3185 1.5509 1.7105 1.4288 2.1366 1.5341 2.5056 2.3219 3.2951 4.3184 2.3708 6.1346 1.9902 2.0539 1.6048 2.0736 1.8533 1.0490 1.0490 1.1463 1.0594 3.4799 2.2163 3.5243 3.1838 3.1298 3.7072 4.8995 7.1111 6.3264 7.2360 7.1258 7.3383 1.0299 1.0299 1.1048 1.1048 1.0844 1.0863 1.0966 1.0906 1.0911 1.1043 1.1043 1.0983 1.0942 1.0942 1.0748 1.0748
irintensity: 3.3905 0.0000 3.3921 0.0000 0.0130 4.4718 0.0000 0.1868 0.0000 3.5583 8.1980 0.0000 5.6041 1.3655 18.5920 12.9549 0.0353 0.0000 16.5147 0.0000 28.3802 10.7051 1.4423 4.5496 2.8994 0.0000 1.4417 0.3012 2.3242 0.0000 2.8406 0.1892 40.2451 0.1316 0.0000 24.3148 0.0000 0.0433 21.1351 6.4685 0.0000 33.9027 0.0000 127.4001 4.3212 3.1466 31.9239 6.3342 5.0884 0.0000 25.8210 0.0000 145.5560 31.9565 2.4636 2.2215 0.0000 0.0000 1.8813 0.0000 15.6104 310.1000 151.9080 34.5162 0.0010 0.4298 66.9939 350.7511 234.6975 0.4138 248.1538 185.1352 64.5954 6.7311 1.0675 0.0628 21.8944 49.9732 193.1319 2.9827 42.1420 134.9647 14.4934 12.4202 64.9014 0.0134 0.1901 71.5858 0.0007 27.2945 159.9367 68.2976 23.8640 417.3007 22.6486 418.4693 764.1416 105.0652 112.0418 97.4112 69.1198 1.6455 672.8082 47.1222 102.2743 25.0289 0.2419 56.2978 8.7017 0.1506 43.1570 7.5885 8.2304 0.0209 34.3640 36.0247 4.7959 4.3287 17.6589 23.8492
temp: 298.150 k
press: 1.00000 atm
elementType: 8 8 8 8 7 7 6 6 6 6 6 6 6 6 6 6 6 6 6 6 6 6 6 6 6 6 1 1 1 1 1 1 1 1 1 1 1 1 1 1 1 1
symmnumber: 1
zpe: 839210.0 jmol-1
zpe.correction: 0.319638 hartree
zpe.thermalcorrener: 0.342194 hartree
zpe.thermalcorrenthalpy: 0.343139 hartree
zpe.thermalcorrgfe: 0.265788 hartree
zpe.sumelectzpe: -1180.396510 hartree
zpe.sumelectthermal: -1180.373954 hartree
zpe.sumelectthermalent: -1180.373010 hartree
zpe.sumelectthermalfe: -1180.450360 hartree
dipole: 0.0000 -3.7196 -0.0001
dipole: 3.7196
quadrupole: -143.8476 -122.2224 -155.5857
quadrupole: 0.0000 0.0006 0.0000
quadrupole: -3.2957 18.3295 -15.0338 0.0000 0.0006 0.0000
hfenergy: -1180.7161482 hartree
pointgroup: C01 [X(C20H16N2O4)]
dipole: -0.000037 -1.4633871 0.0000296 debye
polarizability: 498.6729818|-0.0048975|308.6971479|-0.0204992|-0.0001144|102.9626917 unknown
InChI: InChI=1S/C20H16N2O4/c1-25-19(23)21-15-9-5-11-3-4-12-6-10-16(22-20(24)26-2)14-8-7-13(15)17(11)18(12)14/h3-10,21-22H,1-2H3
charge 0 multiplicity 1
42 atoms
O  5.192198 -2.84013 -0.000153
O  -5.192378 -2.839864 0.000206
O  5.892592 -0.590852 -0.00027
O  -5.89266 -0.59055 0.000242
N  3.601118 -1.245022 -0.000255
N  -3.601218 -1.244835 0.000317
C  0.721444 1.191316 -0.000035
C  -0.721419 1.191353 0.000073
C  1.455092 -0.052202 -0.000088
C  -1.455133 -0.052126 0.00013
C  1.432343 2.448235 -0.00009
C  -1.432253 2.44831 0.000121
C  2.892332 -0.016388 -0.000195
C  -2.892371 -0.016237 0.000241
C  0.692052 -1.278467 -0.000032
C  -0.692157 -1.278431 0.000071
C  0.691134 3.68787 -0.000037
C  -0.690979 3.687906 0.000064
C  2.851723 2.428936 -0.000195
C  -2.851634 2.429085 0.000226
C  3.575488 1.225974 -0.000248
C  -3.575461 1.22616 0.000287
C  4.973053 -1.44496 -0.000315
C  -4.973164 -1.444704 0.00034
C  6.613421 -3.241487 -0.000068
C  -6.613621 -3.24115 0.000071
H  1.192486 -2.253682 -0.000071
H  -1.192642 -2.25362 0.000102
H  1.251923 4.629466 -0.00008
H  -1.251718 4.629532 0.000103
H  3.396913 3.379717 -0.000238
H  -3.396774 3.379894 0.000263
H  4.667037 1.231587 -0.000331
H  -4.66701 1.23183 0.000368
H  3.063153 -2.112064 -0.000219
H  -3.063297 -2.111903 0.000323
H  6.594402 -4.340491 0.000151
H  7.123211 -2.855164 0.898728
H  7.123211 -2.855524 -0.899018
H  -6.594656 -4.340155 0.000058
H  -7.123309 -2.854972 -0.898845
H  -7.123475 -2.854993 0.898901
