program: Gaussian 09
title: 000233931
version: EM64L-G09RevD.01
frameworkgroup: C1[X(C13H18O)]
method: RPBEPBE
basis: SDD
operation: Freq
keyword: #pfreq=noraman
keyword: PBEPBE/SDD
title: #p freq=noraman PBEPBE/SDD
converged: YES YES NO YES
title: Mulliken charges:
elementType: O C C C C C C C C C C C C C H H H H H H H H H H H H H H H H H H
charge: -0.461773 0.174623 0.249060 0.316924 -0.561405 -0.552922 -0.448703 0.351058 -0.572194 0.163861 -0.620840 -0.753703 -0.729770 -0.729703 0.225200 0.225216 0.225858 0.225829 0.223866 0.223828 0.262000 0.221047 0.218230 0.215115 0.215077 0.209419 0.199276 0.263244 0.199304 0.209418 0.263152 0.350409
chargesum: 0.00000
title: Mulliken charges with hydrogens summed into heavy atoms:
elementType: O C C C C C C C C C C C C C
charge: -0.111364 0.174623 0.249060 0.316924 -0.110990 -0.101235 -0.001009 0.351058 -0.310193 0.163861 -0.399793 -0.105280 -0.057831 -0.057830
polarizability: 1.86879577e+02 -1.06518429e+00 1.45767706e+02 -3.20531139e-03 5.69546287e-04 9.41458270e+01
1716.lowfreq: -121.4591 -0.0003 -0.0002 0.0001 5.8256 8.2431 12.9715 67.5292 83.8834
frequency: -121.4495 67.4876 83.8342 151.6555 183.1450 193.9663 211.5152 246.5657 259.7127 282.8925 308.8948 312.5302 329.2056 336.5076 361.6783 395.9684 404.8145 447.8908 480.2808 481.5764 580.5902 610.5206 672.9788 686.6533 733.8836 736.6936 745.1029 802.3918 835.4720 835.7635 890.8011 912.5496 916.4549 922.0166 931.5709 946.7338 994.6219 1020.5633 1031.8214 1039.9417 1042.1726 1121.8728 1143.2315 1147.7802 1188.9453 1199.2305 1204.3078 1208.4174 1224.0928 1236.1575 1254.4004 1274.5316 1287.0125 1299.9922 1302.5034 1369.8589 1370.5304 1382.8823 1397.3913 1411.9712 1454.4639 1458.3357 1466.5365 1467.9942 1475.6950 1476.4791 1488.1446 1488.2982 1504.0086 1505.2570 1598.2898 1623.5797 2969.1699 2971.5920 2976.8035 2979.2944 2979.8564 3018.9334 3018.9919 3023.4680 3057.9851 3061.9748 3066.9375 3072.1120 3076.7084 3092.6471 3104.8406 3108.3571 3152.4503 3570.9041
redmass: 1.5891 3.1365 2.8308 3.9668 3.1774 1.5445 1.5172 1.0762 3.0401 3.3352 4.1666 1.0493 3.2349 1.2926 1.9426 2.7250 2.6152 5.4162 3.5931 2.8831 3.7205 3.3782 5.3824 6.1032 3.7446 6.0215 1.1429 3.9676 1.4231 2.8719 1.3939 2.7369 1.6349 1.5706 1.6931 1.2172 3.3882 1.4483 1.3841 1.7450 3.9496 2.4809 1.1865 1.9410 1.3717 1.2006 2.9648 2.3621 1.4028 1.0692 2.1513 1.9967 1.3916 1.5745 3.9746 1.1831 1.2577 3.1255 1.6062 3.4928 1.0480 1.1271 1.0838 1.0772 1.0484 1.0656 1.1102 1.0520 1.3970 1.6546 7.2588 7.3602 1.0353 1.0367 1.0378 1.0590 1.0593 1.0708 1.0935 1.1022 1.1002 1.0993 1.0997 1.0982 1.1049 1.0910 1.0982 1.0975 1.0901 1.0658
irintensity: 0.5032 0.7285 0.4115 2.2860 1.1601 0.0023 0.0538 0.1089 0.0368 1.2819 4.9984 0.0269 0.7221 74.3965 34.1778 0.8680 14.6525 1.0262 4.6294 4.2799 16.5655 0.3134 0.9849 0.2821 0.0022 6.6621 3.6029 0.1594 28.8296 11.2850 11.6600 0.4202 0.0008 4.6541 3.7947 0.2924 12.2257 7.8226 0.3309 2.6558 10.7482 76.5182 0.0064 135.6073 5.0323 0.0014 7.5312 0.9295 17.8081 0.0030 18.8909 10.7571 23.3329 10.3018 16.3695 25.0047 29.4262 31.2222 10.4768 26.8672 0.2070 2.8080 8.7030 4.6268 0.0848 12.2581 10.6944 10.7247 2.4522 51.3232 5.0445 10.6672 22.9103 44.0709 57.6683 31.0072 53.3107 68.3145 35.0474 0.3900 8.5629 18.4579 49.9879 101.7333 54.1883 21.5341 0.9545 22.6793 7.9354 22.1875
temp: 298.150 k
press: 1.00000 atm
elementType: 8 6 6 6 6 6 6 6 6 6 6 6 6 6 1 1 1 1 1 1 1 1 1 1 1 1 1 1 1 1 1 1
symmnumber: 1
zpe: 722332.9 jmol-1
zpe.correction: 0.275122 hartree
zpe.thermalcorrener: 0.288417 hartree
zpe.thermalcorrenthalpy: 0.289361 hartree
zpe.thermalcorrgfe: 0.236691 hartree
zpe.sumelectzpe: -580.347419 hartree
zpe.sumelectthermal: -580.334124 hartree
zpe.sumelectthermalent: -580.333180 hartree
zpe.sumelectthermalfe: -580.385850 hartree
dipole: 1.6798 0.8397 0.0003
dipole: 1.8780
quadrupole: -82.6973 -75.0199 -88.1203
quadrupole: 1.6558 -0.0013 0.0012
quadrupole: -0.7515 6.9260 -6.1745 1.6558 -0.0013 0.0012
hfenergy: -580.6225409 hartree
pointgroup: C01 [X(C13H18O1)]
dipole: -0.658268 -0.3355388 0.0006021 debye
polarizability: 186.8935035|-0.7415945|145.7523926|0.1598428|-0.2407914|94.1472141 unknown
InChI: InChI=1S/C13H18O/c1-13(2,3)11-7-9-5-4-6-10(9)8-12(11)14/h7-8,14H,4-6H2,1-3H3
charge 0 multiplicity 1
32 atoms
O  1.556996 -2.245012 0.001243
C  2.424134 0.548213 -0.010474
C  -1.47645 0.69276 -0.017749
C  -1.829052 -0.673645 -0.012025
C  -2.709334 1.584789 -0.023929
C  -3.337261 -0.866291 -0.013766
C  -3.924326 0.59008 -0.020531
C  0.935293 0.120767 -0.011019
C  -0.117571 1.073474 -0.017268
C  0.541529 -1.254308 -0.005236
C  -0.816571 -1.652258 -0.005782
C  2.583499 2.091734 -0.018244
C  3.135765 -0.007841 -1.282245
C  3.131016 0.005512 1.269674
H  -2.730681 2.252523 0.859061
H  -2.728289 2.243562 -0.913681
H  -3.669918 -1.442495 -0.898793
H  -3.67292 -1.43547 0.874662
H  -4.562032 0.756765 0.864987
H  -4.560818 0.749077 -0.908331
H  0.131854 2.138564 -0.021852
H  -1.072712 -2.721608 -0.001282
H  3.660106 2.342799 -0.017724
H  2.134675 2.549899 -0.919343
H  2.131706 2.5593 0.876525
H  2.667304 0.39637 -2.199067
H  4.200821 0.293825 -1.27792
H  3.08413 -1.107438 -1.317362
H  4.196166 0.306858 1.265974
H  2.659377 0.419643 2.180428
H  3.078945 -1.093639 1.316341
H  1.147023 -3.145509 0.004929
