program: Gaussian 09
title: 000233930
version: EM64L-G09RevD.01
frameworkgroup: C1[X(C14H16O4)]
method: RPBEPBE
basis: SDD
operation: Freq
keyword: #pfreq=noraman
keyword: PBEPBE/SDD
title: #p freq=noraman PBEPBE/SDD
converged: YES YES NO NO
title: Mulliken charges:
elementType: O O O O C C C C C C C C C C C C C C H H H H H H H H H H H H H H H H
charge: -0.271939 -0.273916 -0.194947 -0.188887 -0.250582 -0.272857 -0.143720 -0.134279 -0.084590 -0.211375 -0.206729 0.113532 0.115285 -0.723334 -0.266859 -0.251022 -0.319987 -0.297066 0.295076 0.272799 0.261514 0.230889 0.246904 0.243552 0.210126 0.220877 0.248674 0.214158 0.257803 0.257167 0.234539 0.220916 0.233417 0.214859
chargesum: 0.00000
title: Mulliken charges with hydrogens summed into heavy atoms:
elementType: O O O O C C C C C C C C C C C C C C
charge: -0.271939 -0.273916 -0.194947 -0.188887 0.044494 -0.000057 0.117794 0.096610 0.162314 0.032178 0.003397 0.113532 0.115285 -0.039625 -0.009056 0.006145 0.135468 0.151210
polarizability: 1.86814312e+02 -8.62059857e+00 1.42132759e+02 1.72311883e+01 -6.72771821e+00 1.32479239e+02
1716.lowfreq: -11.1817 -0.0009 -0.0006 -0.0005 7.5105 17.5111 31.1845 50.4745 58.5555
frequency: 30.8522 50.4285 58.4712 72.8813 76.6252 101.9874 141.5087 175.1865 212.4809 233.7948 239.9752 259.2127 272.1915 307.2335 334.0418 376.6734 416.8091 431.1429 457.5125 495.7150 508.6880 536.4359 585.4719 611.8699 616.9222 677.5830 695.1533 709.5392 747.0769 768.7852 780.5315 840.2785 860.0250 869.5556 879.2371 898.7707 901.2261 923.1015 940.1934 958.4833 976.9016 980.9879 1009.5853 1019.0811 1039.3991 1054.7227 1075.5578 1089.0446 1096.5974 1108.7159 1113.1184 1128.5922 1159.5637 1196.8172 1199.8066 1204.6972 1225.0552 1232.4607 1253.9109 1257.6915 1268.8655 1275.1086 1284.0675 1310.3686 1316.9905 1321.4207 1326.7603 1340.0846 1350.6359 1359.1434 1372.3943 1398.9746 1471.9018 1475.4044 1476.3660 1478.2394 1573.5191 1588.4480 1611.1393 1673.4266 2938.5795 2941.2801 2983.0342 2984.5629 2994.1086 3000.1129 3007.1416 3019.2805 3076.5479 3090.0934 3098.0034 3098.2104 3108.4070 3127.5831 3143.4959 3153.2679
redmass: 3.7826 4.0848 5.0419 5.2062 6.7375 5.1581 3.7430 4.1354 1.2011 2.5766 5.6473 3.6349 3.6704 3.6669 3.3084 5.2191 4.4220 6.3018 5.0256 4.1754 5.1960 3.4282 4.3635 2.8854 2.7935 7.0964 4.2831 2.2047 2.4395 5.2541 2.8020 3.0230 1.9558 2.9814 3.5470 3.3912 2.6113 2.8079 2.6420 2.2365 2.4995 1.4274 1.3164 2.5020 3.0589 2.4803 2.7198 1.7763 2.6777 1.7321 1.9025 1.6821 1.1332 1.2637 2.2007 1.2451 1.4113 1.2237 1.3080 1.6025 1.5677 1.4108 1.4415 1.3945 1.4556 1.3282 1.2590 1.5028 1.3839 2.0065 1.5519 1.2158 1.0895 1.0490 1.0966 1.0523 11.0985 9.5231 7.1474 7.5964 1.0812 1.0803 1.0361 1.0813 1.0691 1.0620 1.0868 1.0851 1.0998 1.0994 1.0866 1.0993 1.1042 1.0865 1.0963 1.0999
irintensity: 3.0433 1.4291 1.4452 7.1899 9.9746 0.1966 0.6115 0.7900 0.2501 0.2437 0.1072 0.5063 1.0360 7.2444 1.5491 18.7138 4.5649 4.9529 6.2532 10.0500 4.9795 7.6875 14.8085 7.2689 1.1324 8.2809 1.2403 39.1048 15.9627 1.6894 8.9664 28.6206 15.1058 37.4854 25.0525 1.6671 7.5272 7.6904 29.2055 10.9736 12.1770 2.1508 0.4233 45.8410 75.0922 14.7958 30.3265 80.4939 35.2619 17.0179 43.5671 5.5496 0.6712 13.2372 10.2776 7.3271 8.9846 5.1548 19.7462 21.5131 20.9836 6.7904 3.7217 25.5906 3.8773 6.7652 1.1113 16.1505 25.7043 2.8374 3.9561 20.0923 5.7005 13.3704 2.9765 5.7566 23.9665 255.1992 3.6039 4.5182 8.2754 23.5382 27.6654 6.6315 75.1116 48.0700 37.1933 16.3543 28.9334 18.2004 17.0187 21.1650 31.5727 0.4291 21.2158 12.8679
temp: 298.150 k
press: 1.00000 atm
elementType: 8 8 8 8 6 6 6 6 6 6 6 6 6 6 6 6 6 6 1 1 1 1 1 1 1 1 1 1 1 1 1 1 1 1
symmnumber: 1
zpe: 714846.0 jmol-1
zpe.correction: 0.272270 hartree
zpe.thermalcorrener: 0.288491 hartree
zpe.thermalcorrenthalpy: 0.289435 hartree
zpe.thermalcorrgfe: 0.227628 hartree
zpe.sumelectzpe: -842.580948 hartree
zpe.sumelectthermal: -842.564727 hartree
zpe.sumelectthermalent: -842.563783 hartree
zpe.sumelectthermalfe: -842.625590 hartree
dipole: 1.6919 -0.4254 0.4131
dipole: 1.7928
quadrupole: -90.5540 -103.4393 -118.8699
quadrupole: -0.5318 -11.1224 3.7206
quadrupole: 13.7337 0.8484 -14.5822 -0.5318 -11.1224 3.7206
hfenergy: -842.853218 hartree
pointgroup: C01 [X(C14H16O4)]
dipole: -0.6422434 -0.2476032 -0.1541094 debye
polarizability: 183.9921689|14.2031287|145.7082787|16.2889916|7.589299|131.7258632 unknown
InChI: InChI=1S/C14H16O4/c1-8-2-3-9(14-17-6-7-18-14)13-11(16)5-4-10(15)12(8)13/h2-5,8-9,12-14H,6-7H2,1H3
charge 0 multiplicity 1
34 atoms
O  -2.490171 -0.852592 1.311436
O  -3.400676 0.779166 -0.154852
O  0.331297 -2.078721 -1.787362
O  3.041736 0.470302 2.220781
C  0.20099 -0.497545 0.106769
C  1.199201 0.59652 0.599553
C  -1.077341 0.086632 -0.535848
C  1.617754 1.563869 -0.565911
C  -2.162184 0.360295 0.532054
C  -0.803086 1.339116 -1.346542
C  0.393191 1.977734 -1.368332
C  0.89545 -1.525927 -0.798678
C  2.443719 -0.031973 1.223082
C  2.364265 2.809796 -0.027343
C  2.275073 -1.928492 -0.401622
C  2.981027 -1.2551 0.558604
C  -3.776751 -1.359498 0.773416
C  -4.499098 -0.058904 0.384547
H  -0.114017 -1.08914 0.996517
H  0.709857 1.214554 1.376123
H  -1.493521 -0.684802 -1.215645
H  2.311372 1.018594 -1.243652
H  -1.853176 1.128211 1.267812
H  -1.646044 1.722554 -1.933496
H  0.516829 2.870311 -1.998161
H  1.700416 3.412161 0.619615
H  3.251848 2.531116 0.566289
H  2.695687 3.450676 -0.865047
H  2.686339 -2.804047 -0.919232
H  3.974691 -1.585262 0.886476
H  -4.263153 -1.925288 1.582567
H  -3.602705 -2.011342 -0.104261
H  -5.241997 -0.175025 -0.420039
H  -4.956119 0.430553 1.266281
