program: Gaussian 09
title: 000233928
version: EM64L-G09RevD.01
frameworkgroup: C1[X(C6H11NO2)]
method: RPBEPBE
basis: SDD
operation: Freq
keyword: #p
keyword: freq=noraman
keyword: PBEPBE/SDD
title: #p freq=noraman PBEPBE/SDD
converged: YES YES NO NO
title: Mulliken charges:
elementType: O O N C C C C C C H H H H H H H H H H H
charge: -0.286661 -0.244000 -0.415274 0.331518 -0.099805 0.151155 -0.682343 -0.662889 -0.685182 0.231303 0.321784 0.236625 0.241074 0.199623 0.204613 0.233747 0.233856 0.229284 0.235731 0.225841
chargesum: 0.00000
title: Mulliken charges with hydrogens summed into heavy atoms:
elementType: O O N C C C C C C
charge: -0.286661 -0.244000 -0.093490 0.331518 0.131498 0.151155 -0.005021 0.009327 0.005674
polarizability: 9.63872836e+01 -1.41081147e-01 7.07458375e+01 -2.26887983e+00 -1.42968415e+00 6.24392419e+01
1716.lowfreq: -7.6945 -0.0002 0.0006 0.0008 13.0446 17.7614 53.9279 98.3247 179.9331
frequency: 53.8071 98.2946 179.9266 204.7567 221.9317 230.7540 295.6639 311.4914 325.2311 391.7573 480.2716 490.1308 544.9784 590.4787 592.8806 684.9695 758.7234 802.1708 854.6659 913.8792 924.1625 955.1794 984.8876 1048.2857 1071.2769 1121.6315 1142.0678 1208.1681 1223.8815 1265.3482 1291.0432 1320.7989 1362.6912 1375.6494 1385.5066 1392.2745 1449.2597 1455.9779 1460.5867 1470.3219 1474.5296 1476.2491 1669.5769 2964.2339 2987.4142 2995.7034 2999.5747 3085.0359 3095.2330 3104.4649 3105.4007 3107.5070 3115.2631 3580.6104
redmass: 3.3173 4.5179 1.0369 1.0876 1.2902 1.8132 2.5357 2.9836 2.5475 3.5366 2.6047 3.1821 1.4608 6.5749 3.8788 4.8792 4.3841 2.7772 3.1891 1.5092 2.7676 1.8532 1.3077 1.8171 1.7619 2.7690 2.1029 2.1728 3.0717 1.4888 2.7176 1.6258 2.1770 1.2714 1.2194 1.2209 1.0494 1.0505 1.0502 1.0720 1.0547 1.0533 9.2348 1.0832 1.0361 1.0363 1.0349 1.0989 1.0988 1.1001 1.1009 1.1013 1.1009 1.0790
irintensity: 2.5045 1.8145 0.0044 1.5770 1.4038 2.1757 4.5735 3.3296 2.7509 2.3639 2.8288 16.9921 108.4548 4.6639 16.7302 17.3349 11.1996 2.3581 8.1738 0.5922 33.2768 3.0895 1.0212 38.4206 9.1691 24.7767 18.7440 86.0603 36.8289 26.5464 101.0004 2.9620 111.4218 38.7353 35.0892 10.1499 1.2082 3.6169 14.9965 5.0526 3.5679 13.3099 376.8730 34.7330 14.8950 18.7134 14.6451 10.5321 32.2765 8.4968 25.8851 26.1640 26.8553 31.6535
temp: 298.150 k
press: 1.00000 atm
elementType: 8 8 7 6 6 6 6 6 6 1 1 1 1 1 1 1 1 1 1 1
symmnumber: 1
zpe: 434822.0 jmol-1
zpe.correction: 0.165615 hartree
zpe.thermalcorrener: 0.175504 hartree
zpe.thermalcorrenthalpy: 0.176448 hartree
zpe.thermalcorrgfe: 0.130971 hartree
zpe.sumelectzpe: -439.729510 hartree
zpe.sumelectthermal: -439.719620 hartree
zpe.sumelectthermalent: -439.718676 hartree
zpe.sumelectthermalfe: -439.764154 hartree
dipole: 3.4418 -0.4592 0.0520
dipole: 3.4727
quadrupole: -55.4631 -58.5835 -52.5142
quadrupole: 9.7689 -2.2215 -0.3046
quadrupole: 0.0572 -3.0632 3.0060 9.7689 -2.2215 -0.3046
hfenergy: -439.8951245 hartree
pointgroup: C01 [X(C6H11N1O2)]
dipole: 1.3626718 0.0940169 -0.0305141 debye
dipolederiv: -1.0091748 0.2196657 -0.0378087 0.1239166 -0.4633163 0.0005018 -0.0275369 0.0656624 -0.4293515 -1.0702658 -0.2394534 -0.0149265 -0.4493053 -0.7018416 0.0288444 0.0409233 0.0550953 -0.351889 -1.3266929 -0.2224247 0.0036497 0.1626937 -0.4165908 -0.0258675 -0.1507676 -0.0315821 -0.5619162 1.0281987 0.0476559 -0.0672644 0.0743134 0.6227416 0.0247707 -0.0676124 -0.0044237 0.721653 0.7072873 -0.1420614 0.0723446 0.0689807 -0.0801394 0.1011197 0.0557319 0.067019 0.3613491 1.741322 0.3238265 0.0965803 0.0846768 0.7452088 -0.126355 0.1629848 -0.1500037 0.1723698 -0.0961961 -0.0378024 -0.0518531 -0.07482 0.022495 -0.039891 -0.0982773 -0.0366222 -0.1503521 -0.1050208 0.0016734 0.0699899 -0.0185132 0.0016526 -0.0439647 0.1357165 -0.0465675 -0.1985276 -0.0964545 0.025765 0.0529994 0.0524158 0.033023 -0.0390968 0.0473705 -0.0206065 0.0173897 -0.0416489 0.0043642 -0.0265736 -0.0200275 0.0422661 -0.0231847 -0.0751194 -0.0078105 -0.1603278 0.1416253 0.0191296 -0.0186479 -0.0159484 0.1609031 0.050035 -0.0126004 0.0479872 0.3465775 0.0139989 -0.0895708 0.003163 -0.1278088 -0.0335014 0.0188705 0.0120706 0.0562656 0.0819769 0.0311076 0.0152491 0.1117524 0.0143875 0.100863 -0.0257229 0.080099 -0.0255577 -0.0716379 -0.012713 0.1035878 -0.0388009 0.1422724 -0.0584897 0.0301047 -0.0318497 -0.0063562 0.0810846 0.0001338 0.1129017 0.0090297 0.1401425 -0.0703168 0.0113147 -0.0087516 0.0430721 0.0706174 0.0013306 -0.0218526 -0.1246392 -0.0149022 0.09383 -0.0267784 -0.0869067 -0.0314633 -0.0573925 -0.0114987 -0.0933965 0.0402463 -0.1267512 -0.0368782 0.0333241 0.0494388 0.004601 0.0867889 0.1041882 -0.008913 0.0150545 0.0321189 -0.1294719 0.0555633 0.0195268 0.0683866 0.0661887 -0.086944 -0.0257749 -0.0282283 -0.0729775 0.0821457 -0.0248052 -0.0303124 -0.0272464 0.0965305 0.0874172 0.0074308 -0.0660671 0.0251359 0.0854173 0.0212173 -0.0141279 -0.0198495 -0.1211315 unknown
polarizability: 96.3445548|-1.6871689|71.0252298|1.6200498|-0.8957846|62.2025784 unknown
InChI: InChI=1S/C6H11NO2/c1-4-5(8)7-6(2,3)9-4/h4,7H,1-3H3
charge 0 multiplicity 1
20 atoms
O  0.3706 1.164607 -0.180869
O  -2.060892 -1.510764 0.050388
N  0.266445 -1.1104 0.244219
C  1.250116 -0.029643 -0.002634
C  -1.015496 0.713035 -0.467206
C  -1.045916 -0.769284 -0.032607
C  2.147197 0.23704 1.212922
C  2.055081 -0.277904 -1.295116
C  -2.019352 1.587635 0.284597
H  -1.202446 0.763356 -1.560786
H  0.536266 -2.048943 0.538912
H  2.73822 1.151719 1.03712
H  1.52985 0.384708 2.113805
H  2.846775 -0.601846 1.382766
H  2.690541 -1.177797 -1.19902
H  1.372413 -0.419344 -2.150451
H  2.70428 0.589686 -1.501772
H  -1.954982 2.632428 -0.063204
H  -3.040745 1.208903 0.104582
H  -1.818656 1.562509 1.368953
