program: Gaussian 09
title: 000233929
version: EM64L-G09RevD.01
frameworkgroup: C1[X(C15H14S3)]
method: RPBEPBE
basis: SDD
operation: Freq
keyword: #pfreq=noraman
keyword: PBEPBE/SDD
title: #p freq=noraman PBEPBE/SDD
converged: YES YES NO NO
title: Mulliken charges:
elementType: S S S C C C C C C C C C C C C C C C H H H H H H H H H H H H H H
charge: 0.321484 0.321328 0.145791 0.522429 0.521752 -0.812606 -0.811993 -0.355394 -0.354951 -0.403229 -0.403733 -0.220375 -0.220405 -0.219633 -0.219596 -0.233473 -0.233471 -0.784878 0.261792 0.288596 0.261728 0.288846 0.243665 0.243806 0.233050 0.233013 0.230768 0.230771 0.229855 0.229864 0.232601 0.232598
chargesum: 0.00000
title: Mulliken charges with hydrogens summed into heavy atoms:
elementType: S S S C C C C C C C C C C C C C C C
charge: 0.321484 0.321328 0.145791 0.522429 0.521752 -0.262218 -0.261419 -0.111728 -0.111145 -0.170179 -0.170720 0.010393 0.010367 0.010221 0.010267 -0.000873 -0.000873 -0.784878
polarizability: 3.25493637e+02 -4.90869846e-02 2.28775470e+02 -4.61832324e+00 7.39011651e-02 1.44537384e+02
1716.lowfreq: -5.9029 -5.2627 -0.0024 -0.0019 -0.0016 6.3079 16.1370 18.2304 25.2852
frequency: 16.1154 17.7961 25.1535 27.8342 43.5174 47.2343 100.3404 102.4376 113.5526 150.5910 210.3077 235.3773 289.9840 299.9042 345.2262 354.8591 402.1066 402.1698 434.6506 447.1978 473.9627 476.4067 544.1786 552.5913 607.4126 613.4764 617.0182 619.8204 700.7362 700.9643 768.4203 772.4482 774.1869 807.2138 809.8918 851.9565 852.1448 891.1763 892.6273 928.7914 929.1698 978.6746 978.7301 989.5444 989.6666 998.8442 998.9442 1001.8548 1026.3851 1026.5521 1074.5110 1076.5506 1129.5800 1134.8593 1174.4260 1174.4482 1189.6622 1189.8811 1218.7766 1224.1859 1225.0238 1227.2400 1328.3188 1328.4854 1385.8125 1385.9164 1440.1497 1440.9994 1451.7005 1466.0214 1483.5798 1483.8023 1592.8882 1593.0245 1612.0292 1612.1707 3026.6206 3029.1783 3112.5022 3114.2907 3120.8552 3120.9760 3126.7539 3126.8847 3138.1913 3138.2733 3150.5729 3150.6580 3166.8733 3166.9767
redmass: 6.1994 4.6764 3.6842 4.9507 9.1754 5.9371 5.8953 5.7951 6.2322 8.1998 7.3588 5.5669 6.3203 6.9350 2.5407 2.5702 2.7987 2.8007 14.6878 7.6231 4.4348 4.8048 6.0995 6.3525 4.8033 5.3508 6.1980 5.3408 1.7281 1.7063 2.7592 1.9653 3.6166 4.0012 4.2680 1.2513 1.2505 1.5099 1.5884 1.4682 1.4755 1.3922 1.3923 6.1160 6.0796 1.3637 1.3302 9.4519 2.2082 2.2016 1.5122 1.5313 1.0920 1.0831 1.0525 1.0524 1.1126 1.1138 1.6328 1.1454 3.2675 1.7894 1.2735 1.2734 8.4264 8.5610 2.1175 2.1432 1.1302 1.1393 2.3071 2.2886 6.0341 6.0089 6.0537 6.0483 1.0583 1.0579 1.1076 1.1068 1.0876 1.0877 1.0869 1.0869 1.0916 1.0916 1.0962 1.0963 1.1016 1.1016
irintensity: 0.1515 0.3169 0.0509 0.4617 0.2023 0.2353 1.4169 0.4520 0.4376 1.0452 2.5718 0.4599 2.7707 1.7422 1.3014 2.4460 0.4289 0.1098 8.4805 4.9963 1.7850 15.9360 33.3568 7.4010 33.6313 12.8448 4.8667 21.2970 47.1873 52.2689 209.7466 27.8810 84.1285 25.8570 6.2993 0.0835 0.0826 2.5574 7.1628 3.5062 3.5809 0.0480 0.2240 3.6752 1.3399 6.3113 0.0514 172.7579 10.9454 1.1471 7.0586 13.2314 6.7473 0.3065 0.0657 0.0303 1.9761 0.9742 2.9425 5.3567 0.4649 22.2221 0.8225 0.1384 0.0516 0.8276 9.5441 9.2092 15.8366 0.7937 21.7761 1.2584 1.7179 0.8364 1.2852 0.4230 4.4296 11.3550 4.9925 5.1771 12.9566 3.6309 2.1898 1.8526 12.8307 9.1994 33.7971 33.6911 47.7030 5.4946
temp: 298.150 k
press: 1.00000 atm
elementType: 16 16 16 6 6 6 6 6 6 6 6 6 6 6 6 6 6 6 1 1 1 1 1 1 1 1 1 1 1 1 1 1
symmnumber: 1
zpe: 637452.9 jmol-1
zpe.correction: 0.242793 hartree
zpe.thermalcorrener: 0.260598 hartree
zpe.thermalcorrenthalpy: 0.261542 hartree
zpe.thermalcorrgfe: 0.191358 hartree
zpe.sumelectzpe: -1772.885392 hartree
zpe.sumelectthermal: -1772.867587 hartree
zpe.sumelectthermalent: -1772.866642 hartree
zpe.sumelectthermalfe: -1772.936827 hartree
dipole: -0.0052 -4.9780 -0.0085
dipole: 4.9780
quadrupole: -105.0749 -136.0581 -126.8837
quadrupole: -0.0545 3.9112 -0.0086
quadrupole: 17.5973 -13.3858 -4.2115 -0.0545 3.9112 -0.0086
hfenergy: -1773.1281849 hartree
pointgroup: C01 [X(C15H14S3)]
dipole: 0.006464 -1.9584576 0.0084733 debye
polarizability: 320.4976725|0.1390463|228.7745925|-30.0057897|-0.3618506|149.534226 unknown
InChI: InChI=1S/C15H14S3/c16-15(17-11-13-7-3-1-4-8-13)18-12-14-9-5-2-6-10-14/h1-10H,11-12H2
charge 0 multiplicity 1
32 atoms
S  -1.05528 1.444441 1.17802
S  1.045545 1.439976 -1.181508
S  -0.014041 4.036875 -0.014892
C  -3.094262 -0.368764 0.414227
C  3.095199 -0.356426 -0.408498
C  -1.610612 -0.172889 0.247915
C  1.611791 -0.16423 -0.235466
C  -4.015173 0.365379 -0.379652
C  4.018194 0.394699 0.366859
C  -3.594091 -1.292788 1.36814
C  3.592618 -1.293889 -1.350466
C  -5.40429 0.172913 -0.227437
C  5.407075 0.205672 0.208384
C  -4.985336 -1.485381 1.522781
C  4.983632 -1.483188 -1.511265
C  -5.893949 -0.753628 0.724439
C  5.894368 -0.734453 -0.731326
C  -0.008195 2.352242 -0.006366
H  -1.031393 -1.005172 0.675633
H  -1.312166 -0.000949 -0.799928
H  1.033479 -1.0040 -0.649513
H  1.318803 0.019241 0.811973
H  -3.638582 1.092501 -1.108946
H  3.643267 1.132275 1.086426
H  -2.891878 -1.862937 1.988911
H  2.888734 -1.87702 -1.957121
H  -6.105071 0.743356 -0.846849
H  6.109518 0.789297 0.813468
H  -5.358332 -2.203193 2.261631
H  5.354788 -2.211488 -2.240717
H  -6.97309 -0.901452 0.842768
H  6.973327 -0.879618 -0.854522
