program: Gaussian 09
title: 000233922
version: EM64L-G09RevD.01
frameworkgroup: C1[X(C17H25NO3)]
method: RPBEPBE
basis: SDD
operation: Freq
keyword: #p
keyword: freq=noraman
keyword: PBEPBE/SDD
title: #p freq=noraman PBEPBE/SDD
converged: YES YES NO NO
title: Mulliken charges:
elementType: O O O N C C C C C C C C C C C C C C C C C H H H H H H H H H H H H H H H H H H H H H H H H H
charge: -0.199297 -0.209968 -0.280175 -0.167781 -0.264340 -0.265613 -0.243443 -0.245263 -0.531538 -0.219362 -0.219611 0.120262 0.125429 -0.336400 -0.405984 -0.254513 -0.248643 -0.387209 -0.344680 -0.350424 -0.693788 0.285747 0.285801 0.274703 0.273130 0.234647 0.258485 0.246790 0.246572 0.274648 0.223660 0.227057 0.229041 0.198427 0.185715 0.181026 0.182338 0.206540 0.209345 0.184279 0.183687 0.197241 0.197598 0.217366 0.209344 0.209157
chargesum: 0.00000
title: Mulliken charges with hydrogens summed into heavy atoms:
elementType: O O O N C C C C C C C C C C C C C C C C C
charge: -0.199297 -0.209968 -0.280175 -0.167781 0.021407 0.020188 0.031260 0.027867 -0.038406 0.027429 0.026960 0.120262 0.125429 0.161909 0.050114 0.129628 0.114721 0.028677 0.023285 0.044415 -0.057921
polarizability: 2.44552917e+02 2.33266189e+00 1.84996029e+02 3.42887650e+00 -4.71398194e+00 1.43684195e+02
1716.lowfreq: -13.1724 -5.7231 -2.5953 -0.0009 0.0005 0.0009 9.6109 17.2768 26.2373
frequency: 9.2224 16.8731 26.1918 38.6282 40.9019 63.7861 81.9964 85.6614 99.4545 116.0930 127.9253 145.8622 181.7588 194.3378 198.6508 230.4566 231.5399 266.8063 293.2504 309.2344 346.3622 369.4018 417.9306 419.8660 474.3413 493.8620 508.6834 514.0720 595.6913 621.0730 655.2593 676.0546 721.0870 730.8045 746.1062 768.2465 772.7517 786.7929 790.1654 802.6042 850.4760 860.5677 876.0452 893.6312 898.2277 899.3223 900.1015 915.0521 928.0519 950.7369 966.3012 979.2820 998.5310 999.1740 1009.0328 1020.9813 1022.3488 1063.2987 1066.5332 1073.1003 1080.6422 1089.3267 1093.9337 1096.7192 1114.5350 1128.2703 1134.9307 1147.1802 1147.7882 1163.9848 1199.6209 1213.3717 1215.2056 1221.0499 1239.5493 1248.6013 1255.5660 1258.6415 1261.7371 1265.0595 1271.0447 1278.4880 1280.6053 1288.7350 1309.9322 1313.6462 1314.0398 1326.4478 1338.0551 1346.0392 1356.1416 1372.7117 1389.7818 1404.3188 1448.1071 1459.9940 1467.6857 1468.3983 1473.7692 1477.9810 1480.8538 1482.4299 1487.3530 1493.2290 1577.4135 1621.5716 1685.2287 2902.4359 2915.4101 2951.2005 2954.1737 2961.4401 2970.4993 2972.3028 2991.4970 2994.7612 3004.1161 3019.9073 3021.9918 3024.6103 3056.2367 3060.0120 3063.5589 3069.2175 3071.7951 3071.8944 3098.9920 3100.1271 3106.3830 3107.7814 3160.8300 3192.9750
redmass: 4.8562 4.6721 2.2808 4.7848 2.2220 3.3873 3.3883 4.5209 2.0721 2.9528 6.1037 2.7568 4.5738 3.4526 3.1350 1.2187 2.3035 2.8559 3.8207 5.0730 3.4489 4.1703 4.5087 4.3776 3.0452 1.9259 4.0468 3.3381 8.6450 4.6221 3.3421 4.9812 1.9046 1.0701 1.9585 1.1366 3.1615 4.8128 2.8299 4.4941 1.1747 2.6132 2.2906 2.0023 2.2209 2.2979 2.3873 2.1421 1.4850 3.0324 1.1462 2.7558 1.8018 1.7562 3.3571 3.1237 1.5561 4.7356 3.3590 2.4275 3.1061 1.2332 2.6043 1.1384 2.2665 2.6301 1.6487 1.5131 1.7733 1.9017 1.4720 1.3100 1.3073 1.2557 1.5565 1.3125 1.2456 1.7723 1.3355 1.4773 1.5225 1.0794 1.6155 1.1040 1.4050 1.3142 1.7418 1.3730 3.2176 1.3984 1.5991 1.5958 1.2163 1.4649 1.0872 1.0966 1.0683 1.0780 1.0745 1.0439 1.0710 1.1032 1.0821 1.0880 5.7302 12.2786 11.4108 1.0547 1.0554 1.1054 1.0587 1.1038 1.0566 1.0389 1.0595 1.0987 1.0612 1.0622 1.0623 1.1030 1.1041 1.0857 1.1014 1.1010 1.0991 1.0872 1.1023 1.0888 1.1029 1.0945 1.0875 1.1097
irintensity: 0.0578 0.2441 1.4408 0.7276 0.1634 0.4593 1.1441 0.2727 1.6095 0.2100 7.1437 6.9284 2.5249 0.8263 0.7420 0.1767 0.4779 3.8752 0.2366 10.0587 7.2372 3.5756 11.9626 3.1884 5.8994 4.0476 0.1236 2.1677 6.9435 7.5012 23.6257 2.2867 39.6668 10.5114 2.1384 0.6354 16.6697 0.3412 15.0978 0.0231 1.1027 20.3265 20.7818 16.0192 10.9016 2.2084 3.9997 0.2349 2.3144 0.1780 0.9494 9.1875 1.3594 0.7742 24.5324 15.3886 22.1987 63.1535 1.6447 27.0595 70.3607 5.3253 17.8599 3.1448 7.5032 25.4525 15.1331 6.2676 5.5947 69.4234 2.3290 23.0562 10.2303 2.1111 0.6129 3.4022 0.0962 2.7083 0.2891 10.8002 0.6376 0.0764 3.6554 0.6124 23.0335 4.2837 10.5403 51.9879 199.4486 11.7523 5.7507 28.2024 12.7454 0.7593 2.7382 31.3298 0.0115 2.7934 12.3308 12.5900 0.5220 10.5627 6.9621 13.2998 4.6618 504.5034 32.5758 30.4786 105.4156 58.2080 19.0726 42.7451 61.1194 29.0345 42.9615 2.8814 18.2754 33.0904 28.9710 13.2797 41.3508 3.4787 16.0586 112.3904 51.7270 14.1892 24.7748 26.3781 3.4348 8.4385 4.3097 20.2455
temp: 298.150 k
press: 1.00000 atm
elementType: 8 8 8 7 6 6 6 6 6 6 6 6 6 6 6 6 6 6 6 6 6 1 1 1 1 1 1 1 1 1 1 1 1 1 1 1 1 1 1 1 1 1 1 1 1 1
symmnumber: 1
zpe: 1027439.4 jmol-1
zpe.correction: 0.391331 hartree
zpe.thermalcorrener: 0.412704 hartree
zpe.thermalcorrenthalpy: 0.413648 hartree
zpe.thermalcorrgfe: 0.336287 hartree
zpe.sumelectzpe: -941.598395 hartree
zpe.sumelectthermal: -941.577022 hartree
zpe.sumelectthermalent: -941.576078 hartree
zpe.sumelectthermalfe: -941.653438 hartree
dipole: 0.6299 0.8993 0.6501
dipole: 1.2760
quadrupole: -103.6416 -136.6195 -123.9866
quadrupole: -9.4490 -1.2144 4.7521
quadrupole: 17.7743 -15.2036 -2.5708 -9.4490 -1.2144 4.7521
hfenergy: -941.9897256 hartree
pointgroup: C01 [X(C17H25N1O3)]
dipole: 0.248361 -0.3170799 -0.2996687 debye
polarizability: 244.5596081|-1.7770802|185.5070135|-3.6882254|0.7809564|143.1665188 unknown
InChI: InChI=1S/C17H25NO3/c1-2-3-4-9-21-10-5-8-18-16(19)14-12-6-7-13(11-12)15(14)17(18)20/h6-7,12-15H,2-5,8-11H2,1H3
charge 0 multiplicity 1
46 atoms
O  0.982528 2.123499 0.494358
O  2.060514 -2.430272 0.777595
O  -2.898254 -0.499445 -0.574651
N  1.226513 -0.226879 0.615807
C  3.23557 1.063596 0.74227
C  3.596402 -0.453237 0.838251
C  3.999671 1.534104 -0.568884
C  4.528661 -0.683945 -0.427739
C  3.84516 0.263573 -1.464495
C  5.49224 1.439094 -0.218318
C  5.808442 0.113415 -0.133782
C  1.710465 1.108219 0.604291
C  2.257419 -1.189731 0.747091
C  -0.196506 -0.589446 0.487618
C  -0.561567 -1.017411 -0.952642
C  -1.991725 -1.560395 -1.027841
C  -4.307175 -0.91296 -0.590429
C  -5.152723 0.276534 -0.127041
C  -6.663802 -0.048115 -0.092218
C  -7.524163 1.154861 0.357621
C  -9.0330 0.831329 0.402897
H  3.538831 1.664974 1.614137
H  4.111577 -0.745786 1.767153
H  3.638118 2.492493 -0.967057
H  4.648746 -1.74271 -0.696859
H  2.797477 -0.000529 -1.6960
H  4.419415 0.341031 -2.401422
H  6.134254 2.294789 0.005849
H  6.759817 -0.328408 0.173329
H  -0.796258 0.285468 0.785292
H  -0.393287 -1.423157 1.186269
H  0.131766 -1.810434 -1.29105
H  -0.461686 -0.15207 -1.633211
H  -2.240451 -1.855925 -2.071543
H  -2.103448 -2.46049 -0.380104
H  -4.598153 -1.225141 -1.61999
H  -4.452296 -1.787704 0.084836
H  -4.808805 0.58579 0.879122
H  -4.963154 1.131046 -0.805011
H  -6.846693 -0.902108 0.593439
H  -6.998989 -0.378381 -1.098031
H  -7.184969 1.489734 1.3589
H  -7.346565 2.005865 -0.330782
H  -9.62512 1.707729 0.724629
H  -9.24102 0.005498 1.109369
H  -9.402578 0.521139 -0.592922
