program: Gaussian 09
title: 000233921
version: EM64L-G09RevD.01
frameworkgroup: C1[X(C8H10N2O3)]
method: RPBEPBE
basis: SDD
operation: Freq
keyword: #p
keyword: freq=noraman
keyword: PBEPBE/SDD
title: #p freq=noraman PBEPBE/SDD
converged: YES YES NO NO
title: Mulliken charges:
elementType: O O O N N C C C C C C C C H H H H H H H H H H
charge: -0.334468 -0.349960 -0.267794 0.064286 -0.371890 0.435854 0.393165 -0.416966 -0.382345 -0.364237 -0.794179 0.296938 -0.605629 0.316544 0.288990 0.302105 0.240880 0.227105 0.240927 0.337426 0.272296 0.235544 0.235408
chargesum: 0.00000
title: Mulliken charges with hydrogens summed into heavy atoms:
elementType: O O O N N C C C C C C C C
charge: -0.334468 -0.349960 -0.267794 0.064286 -0.034465 0.435854 0.393165 -0.100421 -0.093355 -0.062132 -0.085267 0.296938 0.137618
polarizability: 1.70816300e+02 -5.08764714e+00 1.31176617e+02 -5.74466511e-03 -7.71946961e-03 5.48875163e+01
1716.lowfreq: -9.1798 -2.9683 -0.0011 -0.0010 -0.0006 6.9512 23.2470 44.8043 70.7549
frequency: 23.2200 44.8018 70.7299 95.2017 109.0628 158.3370 196.4797 206.7544 234.3731 245.1832 268.7433 312.5794 355.5198 503.9846 509.2597 540.1105 546.4269 593.9310 604.6971 658.1026 665.3838 676.6160 683.2351 830.8688 842.2370 852.9039 887.9637 967.2549 985.7926 996.4008 1036.2920 1048.7860 1081.0979 1126.8431 1133.3838 1152.5921 1163.3085 1196.9233 1271.9842 1284.8366 1324.9759 1399.3311 1407.7898 1432.3571 1458.7418 1461.0085 1467.2137 1481.9021 1483.0962 1513.0029 1547.1122 1612.7756 1704.0836 2986.3206 2987.8721 3066.6964 3070.5084 3097.3828 3118.1711 3207.0367 3210.5204 3228.1977 3575.4558
redmass: 5.7281 4.8399 1.0433 1.0922 4.1523 3.3953 5.2008 3.9024 3.7580 4.4033 7.6354 4.3536 4.9791 4.9894 5.6633 3.3259 6.8096 1.7483 1.9776 7.2038 2.2381 6.6196 11.4233 1.3767 1.6111 4.5252 1.3392 3.1709 2.6031 4.7751 2.2082 1.5258 2.9660 1.2842 2.1610 1.8187 1.8864 2.2791 1.4801 3.6558 6.4431 1.2474 2.6846 1.1631 1.5139 1.8234 1.0448 1.4723 1.0433 1.3814 4.9379 6.1395 9.5106 1.0352 1.0369 1.1028 1.0980 1.0995 1.0987 1.0932 1.0942 1.0941 1.0774
irintensity: 8.9173 2.2875 0.2874 0.3568 4.0212 1.5767 0.1384 3.4968 3.9661 0.3387 1.2264 13.5341 13.6736 2.7255 3.6314 2.4988 5.0560 71.1192 56.5298 2.8947 18.9677 3.5835 33.4467 1.8963 81.8607 35.1590 13.8004 49.6622 4.2805 16.0776 7.3083 14.6035 192.9448 0.1550 560.8538 41.1945 83.8190 152.2047 8.0017 11.5021 59.8380 18.0904 91.5958 27.1554 125.7107 73.0105 15.0295 32.9627 16.7028 231.8979 135.4803 76.7965 266.5744 74.6044 18.3696 32.1805 15.1086 18.5343 3.6135 3.1745 9.1917 2.8481 48.7882
temp: 298.150 k
press: 1.00000 atm
elementType: 8 8 8 7 7 6 6 6 6 6 6 6 6 1 1 1 1 1 1 1 1 1 1
symmnumber: 1
zpe: 460584.7 jmol-1
zpe.correction: 0.175427 hartree
zpe.thermalcorrener: 0.188531 hartree
zpe.thermalcorrenthalpy: 0.189475 hartree
zpe.thermalcorrgfe: 0.134144 hartree
zpe.sumelectzpe: -645.015675 hartree
zpe.sumelectthermal: -645.002572 hartree
zpe.sumelectthermalent: -645.001628 hartree
zpe.sumelectthermalfe: -645.056958 hartree
dipole: -4.5948 1.5403 0.0143
dipole: 4.8461
quadrupole: -65.6133 -78.7990 -77.6069
quadrupole: 22.8796 -0.0429 0.0119
quadrupole: 8.3931 -4.7926 -3.6005 22.8796 -0.0429 0.0119
hfenergy: -645.1911027 hartree
pointgroup: C01 [X(C8H10N2O3)]
dipole: 1.7526502 -0.7029473 0.2632314 debye
dipolederiv: -2.5052406 0.2594502 -0.1379188 0.6098506 -0.491981 0.1005181 -0.2445192 0.0915242 -0.2445561 -0.6813306 0.3565124 -0.1163707 0.4271476 -0.8411702 0.1635218 -0.1374735 0.1616815 -0.3873148 -0.8372926 -0.0273009 -0.0054554 0.0024714 -0.9277646 0.1754238 -0.0147062 0.1753318 -0.3909689 0.707165 -0.4081775 0.1377781 -0.4785266 0.8039165 -0.2165031 0.1587682 -0.2146965 0.195264 -1.5213274 -0.1800178 0.0257754 -0.3199363 -0.4352309 -0.0311652 0.0690965 -0.0267946 -0.4999089 0.3560149 0.0647726 -0.0109818 0.0436414 0.4505806 -0.1289574 -0.0046661 -0.1281373 0.0573068 1.8059809 -0.1225396 0.0787661 0.2501971 0.3350717 -0.0442916 -0.0336259 -0.0540657 0.1826919 -0.5724614 -0.092494 0.0185067 -0.2413053 -0.3252468 0.0288885 0.0636793 0.032909 -0.217433 -0.0176622 -0.0770693 0.026951 0.1550722 -0.452915 0.0888787 -0.0430239 0.0831086 -0.1973299 -0.6135326 0.2862049 -0.0972362 0.1101107 -0.0869068 -0.0294995 -0.043685 -0.0251526 -0.1870946 0.0630868 -0.0254435 0.0079965 -0.0983984 -0.1285 0.0503561 0.0299181 0.0517942 0.0322822 2.8191778 0.0632114 0.0492855 -0.3470422 1.3549029 -0.3152468 0.1749683 -0.3057998 0.421332 0.5905582 -0.0450676 0.0236818 -0.3109981 0.0613958 0.0523897 0.1022034 0.0593348 0.2535232 0.2029331 0.0280833 -0.0079054 0.0335486 0.0832073 0.0316031 -0.0097258 0.0313093 0.1751955 0.0173681 -0.0196985 0.0017045 0.0071167 0.083222 0.0321776 -0.0064564 0.0314476 0.1795142 0.0797811 0.0024866 -0.0038637 -0.031943 0.0751948 0.0385583 0.0064404 0.0393857 0.1937857 0.0693353 -0.0097664 -0.0721746 -0.0223774 0.0571563 0.0529951 -0.0256584 0.0882446 -0.080603 -0.1424256 -0.0415183 0.0063054 0.0583683 0.0762736 0.0125877 -0.0238025 0.0102118 0.1096938 0.0643192 0.0379168 0.0682761 0.0003 -0.0493008 -0.0725027 0.0369477 -0.106428 0.0308094 0.1752741 0.0274111 -0.0140941 0.0992348 0.189372 0.0584343 -0.0357813 0.0562825 0.3581456 0.1447606 -0.0722046 0.0210957 0.0397024 -0.0118457 0.0440182 -0.0119728 0.0410088 0.1226828 -0.0957162 -0.0233632 -0.0766642 -0.0337403 0.0563094 -0.1095409 -0.1505058 -0.0897804 -0.0268334 -0.1087658 0.0186119 0.0765422 0.0475056 0.1242589 0.0173562 0.1435809 -0.0027193 -0.0801843 unknown
polarizability: 169.6770386|-7.0146677|125.6990523|5.0998249|-21.5192953|61.5043417 unknown
InChI: InChI=1S/C8H10N2O3/c1-6-3-7(5-10(12)4-6)13-8(11)9-2/h3-5,9H,1-2H3
charge 0 multiplicity 1
23 atoms
O  1.297113 0.595263 -0.226206
O  -3.046922 2.283726 -0.844167
O  2.189602 -1.528077 0.434482
N  -2.273969 1.249174 -0.512624
N  3.527419 0.334117 -0.084886
C  -2.057402 -1.076347 0.194839
C  -0.080616 0.279439 -0.165593
C  -0.639452 -0.966398 0.196853
C  -2.848037 0.025564 -0.157152
C  -0.892843 1.372754 -0.516062
C  -2.719575 -2.38738 0.57338
C  2.343391 -0.336096 0.08229
C  4.824668 -0.308332 0.145481
H  -0.00361 -1.808992 0.467008
H  -3.937963 0.022671 -0.183163
H  -0.500948 2.347669 -0.800909
H  -2.439256 -2.686961 1.599665
H  -3.819091 -2.318209 0.5259
H  -2.397892 -3.199231 -0.104103
H  3.477234 1.310217 -0.378189
H  4.642093 -1.351778 0.446206
H  5.383114 0.200408 0.9522
H  5.43814 -0.306502 -0.773748
