program: Gaussian 09
title: 000233915
version: EM64L-G09RevD.01
frameworkgroup: C1[X(C13H21NO2)]
method: RPBEPBE
basis: SDD
operation: Freq
keyword: #p
keyword: freq=noraman
keyword: PBEPBE/SDD
title: #p freq=noraman PBEPBE/SDD
converged: NO YES NO NO
title: Mulliken charges:
elementType: O O N C C C C C C C C C C C C C H H H H H H H H H H H H H H H H H H H H H
charge: -0.308799 -0.256883 -0.441245 0.349291 0.232852 -0.431345 -0.439191 -0.454538 -0.462715 0.099252 -0.405501 -0.406557 -0.399694 -0.400653 -0.388123 -0.391594 0.215856 0.216686 0.216923 0.219057 0.215275 0.203019 0.206476 0.215135 0.317813 0.193373 0.212061 0.212327 0.193054 0.193107 0.242438 0.244224 0.193108 0.199389 0.207762 0.205325 0.183034
chargesum: 0.00000
title: Mulliken charges with hydrogens summed into heavy atoms:
elementType: O O N C C C C C C C C C C C C C
charge: -0.308799 -0.256883 -0.123432 0.349291 0.232852 0.001198 -0.003211 -0.036244 -0.041104 0.099252 -0.000067 -0.001176 0.035851 0.036680 0.019028 -0.003234
polarizability: 1.88134265e+02 2.65339568e-02 1.27182887e+02 -2.94445362e+00 3.12136479e-02 1.23162076e+02
1716.lowfreq: -46.2094 -26.5207 -10.6413 -2.8205 -0.0005 -0.0002 0.0007 69.3861 78.4918
frequency: -39.6988 69.3177 78.4642 124.0327 140.0747 195.6871 222.5286 227.5455 257.4321 261.0755 273.6886 341.3721 343.0485 373.9928 401.5928 422.7325 438.9513 467.2480 488.9448 493.8671 549.5735 553.5489 619.1337 639.0756 682.0015 709.5434 773.7449 783.0287 786.8009 816.6119 832.3882 842.4873 850.2667 902.3865 902.7656 907.8693 927.0111 942.3249 945.1809 960.1086 979.1250 1022.0844 1033.0408 1044.8310 1046.3217 1061.8316 1072.7427 1093.1191 1095.4643 1127.1673 1137.2392 1155.4567 1172.0912 1210.6795 1224.0193 1233.4263 1249.3975 1256.4265 1261.1638 1268.1905 1274.9734 1306.9930 1311.5985 1313.9612 1327.2379 1330.6328 1336.4075 1338.2393 1341.7776 1342.1330 1346.7800 1355.9243 1377.5911 1450.8238 1457.7195 1460.0045 1460.5421 1462.8222 1469.2568 1471.0809 1472.8175 1476.0926 1482.1657 1644.9612 2962.1687 2962.9229 2964.5048 2974.6440 2979.6930 2982.6491 2991.0912 2992.3538 2994.3516 2999.7271 3031.3481 3034.6393 3036.9952 3037.7874 3042.7924 3043.8239 3053.9735 3061.0653 3061.4265 3067.7274 3580.3232
redmass: 4.4019 3.7374 3.2262 3.2888 3.6883 2.4925 2.1909 3.8780 2.9134 2.3483 2.2866 4.7462 1.8427 2.1660 3.6052 3.0219 3.3723 2.3768 1.7464 1.7949 3.7921 1.4296 2.8627 4.7333 4.6481 6.3890 1.4534 1.4603 4.1229 2.1360 2.7847 1.8979 1.6334 2.2950 2.4084 2.1389 1.3809 1.4009 2.7295 2.9321 1.7699 3.7107 3.1983 2.0766 1.9065 1.2798 1.3919 1.6077 1.5627 1.6197 1.7728 2.3577 2.2768 1.9725 1.9005 1.5998 1.3344 1.3947 1.2454 1.2999 1.8297 1.4067 1.4653 1.7896 1.5167 1.3996 1.5306 1.4039 1.4497 1.5490 1.3807 1.4452 2.3029 1.0844 1.0817 1.0904 1.0829 1.0909 1.0860 1.0843 1.0855 1.0983 1.0904 8.3914 1.0635 1.0664 1.0665 1.0612 1.0594 1.0601 1.0622 1.0635 1.0611 1.0620 1.0964 1.0954 1.0936 1.1013 1.1015 1.1014 1.1031 1.1028 1.1024 1.1028 1.0783
irintensity: 1.1167 0.7996 0.1903 1.5843 1.0942 0.2325 0.1507 0.3540 4.9932 5.1765 0.3425 5.3044 0.1782 0.7790 1.7822 0.0383 5.3366 3.8453 1.2310 2.8014 12.9030 92.7854 3.2265 6.8778 13.3112 16.5946 0.4626 0.8142 7.1407 1.4587 2.2205 0.3136 34.5073 4.2237 18.7417 7.2801 7.8633 3.5502 9.6851 18.2292 8.9862 121.2448 4.8651 1.5615 1.8750 3.6957 1.5343 0.9358 0.0965 6.3053 1.6488 9.6780 6.0863 3.3182 9.0961 65.8510 29.3121 14.3509 1.4033 0.0343 13.3038 0.1310 4.2308 8.7574 10.4235 0.1798 25.0727 0.7075 2.2787 21.4120 0.1373 4.5053 148.2359 4.7442 3.5917 4.9697 17.3768 3.0034 8.5910 3.1297 40.8886 15.0423 7.6033 370.8065 43.5439 26.5345 33.1939 36.8477 5.5896 41.4110 57.1042 28.7033 11.7177 23.7229 72.7930 49.8495 60.5422 59.0883 9.8525 42.6442 1.8752 19.5137 68.9351 62.4993 26.4366
temp: 298.150 k
press: 1.00000 atm
elementType: 8 8 7 6 6 6 6 6 6 6 6 6 6 6 6 6 1 1 1 1 1 1 1 1 1 1 1 1 1 1 1 1 1 1 1 1 1
symmnumber: 1
zpe: 847912.0 jmol-1
zpe.correction: 0.322953 hartree
zpe.thermalcorrener: 0.336787 hartree
zpe.thermalcorrenthalpy: 0.337732 hartree
zpe.thermalcorrgfe: 0.283617 hartree
zpe.sumelectzpe: -711.954111 hartree
zpe.sumelectthermal: -711.940276 hartree
zpe.sumelectthermalent: -711.939332 hartree
zpe.sumelectthermalfe: -711.993447 hartree
dipole: 3.1078 0.1474 -1.3051
dipole: 3.3739
quadrupole: -88.8858 -95.0332 -105.1436
quadrupole: -0.2425 6.8945 0.1144
quadrupole: 7.4684 1.3210 -8.7894 -0.2425 6.8945 0.1144
hfenergy: -712.2770634 hartree
pointgroup: C01 [X(C13H21N1O2)]
dipole: 1.2248014 0.0588063 0.5083444 debye
polarizability: 188.1585775|0.4143117|126.9727693|2.6298569|-0.8996056|123.3478819 unknown
InChI: InChI=1S/C13H21NO2/c15-11-12(7-3-1-4-8-12)16-13(14-11)9-5-2-6-10-13/h14H,1-10H2
charge 0 multiplicity 1
37 atoms
O  0.116759 0.387008 1.09535
O  -1.330728 -0.361016 -2.153221
N  0.749698 -0.117464 -1.072982
C  1.326542 0.154544 0.260176
C  -1.13859 0.169442 0.303405
C  2.109583 -1.057004 0.818052
C  2.194095 1.431883 0.278886
C  -1.91264 -1.023271 0.919647
C  -1.979423 1.468225 0.365673
C  -0.631844 -0.135257 -1.12462
C  3.458914 -1.262974 0.085266
C  3.547797 1.232298 -0.448009
C  -3.324133 -1.19351 0.306918
C  -3.391603 1.291297 -0.24464
C  4.321501 0.021026 0.126223
C  -4.144466 0.113461 0.417715
H  1.472324 -1.957587 0.7485
H  2.292743 -0.862399 1.892296
H  2.374297 1.688444 1.34047
H  1.616445 2.261229 -0.16806
H  -1.993668 -0.820915 2.006201
H  -1.320009 -1.950884 0.804503
H  -1.432447 2.286556 -0.139796
H  -2.060977 1.743536 1.436086
H  1.319983 -0.299418 -1.898734
H  3.273854 -1.55266 -0.970688
H  4.003173 -2.108534 0.546411
H  4.152386 2.154365 -0.358484
H  3.375682 1.080325 -1.534667
H  -3.845946 -2.02282 0.822485
H  -3.229738 -1.473402 -0.759133
H  -3.298809 1.099321 -1.32999
H  -3.960166 2.233184 -0.121222
H  4.602494 0.235405 1.177636
H  5.263494 -0.132544 -0.434022
H  -5.133908 -0.019774 -0.060129
H  -4.329471 0.345981 1.487697
