program: Gaussian 09
title: 000233913
version: EM64L-G09RevD.01
frameworkgroup: C1[X(C11H12Cl3NO4)]
method: RPBEPBE
basis: SDD
operation: Freq
keyword: #p
keyword: freq=noraman
keyword: PBEPBE/SDD
title: #p freq=noraman PBEPBE/SDD
converged: YES YES NO NO
title: Mulliken charges:
elementType: Cl Cl Cl O O O O N C C C C C C C C C C C H H H H H H H H H H H H
charge: 0.085589 0.115768 0.117355 -0.190296 -0.269901 -0.244181 -0.396010 -0.172712 -0.255679 -0.256271 -0.484546 -0.487045 0.178596 0.240352 -0.187598 -0.185656 -0.286981 0.093596 -0.609980 0.289532 0.290030 0.235695 0.245502 0.247255 0.234614 0.231077 0.231660 0.260347 0.268702 0.268492 0.392697
chargesum: 0.00000
title: Mulliken charges with hydrogens summed into heavy atoms:
elementType: Cl Cl Cl O O O O N C C C C C C C C C C C
charge: 0.085589 0.115768 0.117355 -0.190296 -0.269901 -0.244181 -0.003314 -0.172712 0.033852 0.033759 -0.003350 -0.005176 0.178596 0.240352 0.043479 0.046003 0.242068 0.362088 -0.609980
polarizability: 1.90898441e+02 -5.89562261e+00 1.51776008e+02 1.90052444e+01 1.82537354e+01 1.36821625e+02
1716.lowfreq: -5.1132 -0.0007 -0.0002 0.0027 4.3506 7.9893 16.7407 29.9473 37.5070
frequency: 16.6978 29.8544 37.4599 57.9070 72.4164 125.7115 142.4789 149.6737 163.2967 178.3210 194.6091 213.5581 224.0386 246.5437 250.2462 278.9793 320.7371 338.6371 362.8409 375.2045 385.5612 409.8192 454.0432 470.2947 559.5758 566.4769 572.5011 595.5566 625.9203 654.0605 696.8437 711.1185 730.1623 744.2520 752.7062 772.8005 816.8243 840.9598 849.7218 928.7764 939.0338 953.4263 959.2135 966.3585 972.6541 994.6960 1041.8459 1052.4961 1052.9914 1097.1783 1105.8504 1114.6854 1148.9127 1181.7824 1198.6348 1199.6858 1218.2980 1263.9796 1277.3067 1282.0939 1288.7423 1309.2970 1312.4760 1319.9766 1324.4262 1336.9035 1361.9067 1398.7874 1428.9168 1455.4445 1466.4921 1475.0789 1614.6395 1652.7380 1693.5742 2968.5510 2974.5385 3019.2123 3024.3051 3031.5709 3035.2700 3056.5584 3075.6052 3077.9443 3107.8433 3126.0992 3157.1342
redmass: 9.4617 12.4565 3.3739 9.9040 8.6432 9.7991 9.1765 2.8513 8.6490 8.8622 5.8089 10.4995 6.4522 10.2201 8.0382 7.1957 7.1619 3.9236 6.3870 11.8055 3.1831 5.1146 3.5811 4.9278 4.9548 4.8957 5.5545 9.4699 5.3368 2.4623 2.4842 1.9920 7.1384 5.3869 4.9116 5.2474 1.3521 3.2826 3.7340 1.8967 2.1511 2.4094 2.6380 1.7000 7.4466 7.5018 2.4526 3.4884 3.0623 5.0292 2.3046 2.4988 1.1759 2.3759 1.2267 1.3770 1.4123 1.3801 1.1883 1.2219 1.1790 1.4974 1.8203 1.3809 2.0050 1.4923 1.6693 1.2907 1.1520 1.1208 1.0798 1.0879 11.1576 6.6225 11.2576 1.0686 1.0688 1.0832 1.0815 1.0570 1.0843 1.0757 1.0938 1.0941 1.1093 1.0859 1.1023
irintensity: 0.3448 0.6548 0.0090 1.2226 0.9746 0.4682 2.6896 2.4296 2.9895 2.8962 1.6216 1.9683 3.2804 0.6476 1.8480 4.0472 1.7982 6.2698 21.4581 3.9608 12.2947 24.9550 4.2313 18.1822 19.3594 10.2785 58.5651 25.8591 2.9435 33.3964 1.0025 36.7034 89.8850 81.5930 148.0631 70.0305 240.2591 6.1215 71.1433 13.2189 0.4246 49.0002 1.6477 13.8496 290.9742 29.8866 7.2215 13.6037 5.5110 122.1426 7.8367 13.5904 1.2999 129.4095 4.4124 13.0935 14.2541 2.1766 21.6425 3.7504 7.6212 6.1422 15.8631 35.3115 123.1946 70.1732 0.6498 15.8470 66.0447 46.3492 4.8584 14.7665 497.8251 12.3314 73.4289 17.7679 8.5712 3.2499 390.8796 15.7426 9.8703 413.2133 22.4146 5.8419 3.7620 4.8953 36.0590
temp: 298.150 k
press: 1.00000 atm
elementType: 17 17 17 8 8 8 8 7 6 6 6 6 6 6 6 6 6 6 6 1 1 1 1 1 1 1 1 1 1 1 1
symmnumber: 1
zpe: 580382.3 jmol-1
zpe.correction: 0.221056 hartree
zpe.thermalcorrener: 0.239472 hartree
zpe.thermalcorrenthalpy: 0.240416 hartree
zpe.thermalcorrgfe: 0.172085 hartree
zpe.sumelectzpe: -2160.747604 hartree
zpe.sumelectthermal: -2160.729188 hartree
zpe.sumelectthermalent: -2160.728244 hartree
zpe.sumelectthermalfe: -2160.796575 hartree
dipole: 4.9765 -0.2737 -0.9245
dipole: 5.0691
quadrupole: -123.1415 -131.8243 -137.4196
quadrupole: -10.3067 -4.0332 -5.7094
quadrupole: 7.6536 -1.0292 -6.6244 -10.3067 -4.0332 -5.7094
hfenergy: -2160.9686602 hartree
pointgroup: C01 [X(C11H12Cl3N1O4)]
dipole: 1.9350747 0.4409023 -0.1960295 debye
polarizability: 193.4131605|-14.270071|123.0611178|3.6320642|-6.8626759|163.021796 unknown
InChI: InChI=1S/C11H12Cl3NO4/c12-11(13,14)10(18)19-5-15-8(16)6-3-1-2-4-7(6)9(15)17/h1-2,6-7,10,18H,3-5H2
charge 0 multiplicity 1
31 atoms
Cl -2.062551 -1.368529 -1.443604
Cl -4.933873 -0.472894 -1.0817
Cl -3.632468 -2.193382 1.02484
O  1.774227 0.310879 2.864266
O  -0.188821 1.507358 -1.222166
O  -1.678156 0.073324 1.302518
O  -2.698506 1.58594 -0.302421
N  0.519953 0.974385 0.969087
C  2.80104 0.341642 0.578846
C  2.132513 0.724483 -0.775094
C  3.402407 -1.102053 0.614395
C  2.147871 -0.419944 -1.84232
C  1.705651 0.517349 1.634318
C  0.70446 1.125842 -0.414544
C  4.112992 -1.410011 -0.691555
C  3.511703 -1.086339 -1.866967
C  -0.762523 1.150744 1.67006
C  -2.887775 0.476396 0.545789
C  -3.338122 -0.827137 -0.198864
H  3.617336 1.048435 0.814299
H  2.635877 1.600989 -1.220899
H  2.579026 -1.830183 0.767409
H  4.070249 -1.198416 1.486076
H  1.865253 -0.007752 -2.824795
H  1.371611 -1.168285 -1.578031
H  5.089639 -1.906612 -0.664004
H  3.980444 -1.308743 -2.832353
H  -0.542683 1.052207 2.745215
H  -1.189162 2.138129 1.422253
H  -3.701585 0.744426 1.246142
H  -1.832731 1.516947 -0.837291
