program: Gaussian 09
title: 000233912
version: EM64L-G09RevD.01
frameworkgroup: C1[X(C15H15ClN2O2)]
method: RPBEPBE
basis: SDD
operation: Freq
keyword: #p
keyword: freq=noraman
keyword: PBEPBE/SDD
title: #p freq=noraman PBEPBE/SDD
converged: YES YES NO NO
title: Mulliken charges:
elementType: Cl O O N N C C C C C C C C C C C C C C C H H H H H H H H H H H H H H H
charge: -0.078342 -0.221350 -0.222737 -0.149454 -0.375715 -0.225508 -0.228763 -0.488298 -0.489998 0.160221 0.169558 -0.188579 -0.182622 -0.464901 0.490860 -0.331779 -0.412444 -0.228457 -0.193669 -0.122484 0.262929 0.264840 0.247468 0.223984 0.222936 0.249290 0.229555 0.231726 0.272517 0.261139 0.314142 0.274074 0.226406 0.252900 0.250555
chargesum: 0.00000
title: Mulliken charges with hydrogens summed into heavy atoms:
elementType: Cl O O N N C C C C C C C C C C C C C C C
charge: -0.078342 -0.221350 -0.222737 -0.149454 -0.061572 0.037421 0.036076 -0.016847 -0.017772 0.160221 0.169558 0.040976 0.049105 0.068755 0.490860 -0.057706 -0.186038 0.024443 0.056886 -0.122484
polarizability: 2.12307989e+02 -2.94489908e+01 1.61161536e+02 -6.04494042e+00 -2.38028313e+01 1.59779326e+02
1716.lowfreq: -11.9337 -8.7495 0.0009 0.0025 0.0026 3.1807 14.2747 24.8485 53.0786
frequency: 10.7103 23.3483 53.0471 58.4648 65.3454 97.8638 125.5248 140.1431 172.1765 228.5817 239.1636 262.8943 288.1148 322.0301 330.1772 357.8096 378.3702 407.5994 412.0323 468.4614 471.1749 496.6166 508.1651 530.8748 554.0803 599.2969 614.8776 627.1640 632.8030 669.9438 685.7290 697.8848 703.6110 745.9906 786.6111 807.3189 823.8468 829.6413 859.4857 892.5364 925.3598 930.8120 933.2677 940.7496 950.1163 969.1629 986.6578 1003.8022 1018.2384 1057.0342 1074.1600 1089.5019 1100.3343 1108.5598 1136.0477 1154.5872 1177.8767 1190.0788 1193.9345 1207.2288 1214.8331 1249.7021 1251.9418 1267.8771 1292.7626 1298.9696 1317.2074 1317.4410 1332.6934 1345.8013 1372.7424 1377.5832 1399.5706 1413.2712 1463.4843 1463.9869 1468.6900 1480.1553 1508.1090 1590.8826 1612.4586 1621.9780 1658.8049 1684.9990 2972.3381 2976.1479 3011.1150 3028.0575 3036.4347 3057.3450 3059.1621 3099.6790 3123.8399 3125.2449 3143.3772 3154.8135 3166.1682 3169.4112 3559.8937
redmass: 5.9993 4.4586 4.5553 6.7106 6.3839 7.4873 4.2546 7.9217 5.2763 3.8355 4.4709 3.4499 4.7185 5.8790 3.1486 7.7136 3.2671 4.8077 3.2527 3.5258 3.2502 1.8490 2.4061 2.2210 4.2432 9.0221 4.6770 6.1980 5.2909 3.1871 3.2958 3.0826 1.9502 3.7058 4.4637 1.3415 1.5627 3.2164 3.6256 2.8871 2.5729 1.4260 2.4871 2.4205 1.3416 1.4294 4.2958 2.2777 3.3818 2.1609 2.7882 2.1279 2.1455 1.9505 1.9885 1.0892 1.4717 1.1945 1.1409 1.5601 1.4718 1.4861 1.5559 2.4984 1.5786 1.4903 1.6786 1.6307 1.7628 1.5117 1.6929 3.2112 1.4563 3.0898 1.0867 1.1093 1.0941 1.8849 2.1413 5.5197 7.3568 8.1753 6.4621 11.2218 1.0666 1.0669 1.0835 1.0849 1.0588 1.0949 1.0947 1.1067 1.0856 1.0894 1.0897 1.1017 1.0953 1.0964 1.0766
irintensity: 0.1598 0.3275 0.4272 0.3925 0.9081 1.0105 5.0969 3.7067 2.0673 1.4030 2.1770 1.0071 0.8129 3.3238 4.0048 30.9526 3.1867 3.9611 1.4840 14.4001 6.8026 86.0615 19.4258 73.0711 8.3513 11.7604 20.3041 4.5578 19.4044 73.8302 12.0507 0.6874 12.0556 15.3384 11.7800 21.1357 72.3090 16.6335 3.3841 4.8117 9.2162 0.9246 9.1274 15.7178 1.3656 0.1206 18.0008 26.4475 7.2156 5.7118 45.2716 4.5663 1.9825 30.2415 27.0038 5.9440 39.3800 48.2069 20.6887 76.7603 2.3461 29.9918 8.4527 308.8944 10.1390 47.9435 20.8531 19.5456 39.7472 7.6143 1.4717 25.0222 36.4761 3.1494 32.5554 25.8009 15.6472 48.3656 228.7407 13.6136 157.4831 349.2931 3.9948 28.4696 54.3700 13.4094 11.3550 22.9615 26.8615 12.0715 4.0181 1.8947 2.5488 12.8095 1.3079 24.4116 5.9156 1.5571 33.2181
temp: 298.150 k
press: 1.00000 atm
elementType: 17 8 8 7 7 6 6 6 6 6 6 6 6 6 6 6 6 6 6 6 1 1 1 1 1 1 1 1 1 1 1 1 1 1 1
symmnumber: 1
zpe: 716658.8 jmol-1
zpe.correction: 0.272961 hartree
zpe.thermalcorrener: 0.290463 hartree
zpe.thermalcorrenthalpy: 0.291407 hartree
zpe.thermalcorrgfe: 0.224729 hartree
zpe.sumelectzpe: -1299.181309 hartree
zpe.sumelectthermal: -1299.163807 hartree
zpe.sumelectthermalent: -1299.162863 hartree
zpe.sumelectthermalfe: -1299.229541 hartree
dipole: -4.7442 0.3219 -0.7668
dipole: 4.8166
quadrupole: -126.4610 -120.6942 -126.5401
quadrupole: 9.2238 -5.4126 1.4293
quadrupole: -1.8959 3.8709 -1.9750 9.2238 -5.4126 1.4293
hfenergy: -1299.4542703 hartree
pointgroup: C01 [X(C15H15Cl1N2O2)]
dipole: 1.7936341 0.0814113 0.6059817 debye
polarizability: 189.848431|24.4951165|158.2418515|36.7412076|-11.2119186|185.1585678 unknown
InChI: InChI=1S/C15H15ClN2O2/c16-10-5-7-11(8-6-10)17-9-18-14(19)12-3-1-2-4-13(12)15(18)20/h1-2,5-8,12-13,17H,3-4,9H2
charge 0 multiplicity 1
35 atoms
Cl -4.814444 -1.477839 -2.570531
O  1.948897 -0.564538 2.651601
O  0.835826 2.519571 -0.68233
N  1.152484 1.058341 1.145238
N  -1.033531 0.172096 1.8734
C  3.287192 0.099918 0.633252
C  2.918591 1.139943 -0.469056
C  3.534056 -1.350533 0.108437
C  2.875813 0.569802 -1.921177
C  2.099289 0.121504 1.609439
C  1.534015 1.677147 -0.066106
C  2.551144 -1.71744 -0.989567
C  2.240844 -0.809197 -1.952248
C  -0.136844 1.299999 1.865309
C  -1.878635 -0.195702 0.808401
C  -1.985396 0.573052 -0.385856
C  -2.675465 -1.36963 0.941685
C  -2.881667 0.18392 -1.40479
C  -3.562731 -1.763569 -0.078821
C  -3.660159 -0.976179 -1.243011
H  4.179481 0.420613 1.20263
H  3.61351 2.000489 -0.453002
H  3.472888 -2.050224 0.960516
H  4.571701 -1.406345 -0.27987
H  3.915433 0.516596 -2.304501
H  2.33215 1.282824 -2.565437
H  2.105042 -2.718813 -0.989085
H  1.53349 -1.050545 -2.754072
H  0.124422 1.548191 2.90744
H  -0.593146 2.180269 1.382532
H  -0.859507 -0.52792 2.595405
H  -1.368012 1.463083 -0.544547
H  -2.605508 -1.973937 1.854392
H  -2.960391 0.780147 -2.318705
H  -4.170532 -2.666093 0.034739
