program: Gaussian 09
title: 000004335
version: EM64L-G09RevD.01
frameworkgroup: C1[X(C11H14N2O5)]
method: RPBEPBE
basis: SDD
operation: Freq
keyword: #p
keyword: freq=noraman
keyword: PBEPBE/SDD
title: #p freq=noraman PBEPBE/SDD
converged: YES YES NO NO
title: Mulliken charges:
elementType: O O O O O N N C C C C C C C C C C C H H H H H H H H H H H H H H
charge: -0.449783 -0.481302 -0.252211 -0.212746 -0.208348 -0.405771 0.026263 -0.147496 -0.217802 0.470631 -0.383737 -0.401768 -0.348802 0.235020 -0.370010 -0.355641 0.376334 -0.772506 0.300316 0.242956 0.232956 0.228624 0.324483 0.262830 0.288943 0.353123 0.285084 0.285514 0.362492 0.260004 0.255353 0.216999
chargesum: 0.00000
title: Mulliken charges with hydrogens summed into heavy atoms:
elementType: O O O O O N N C C C C C C C C C C C
charge: -0.096660 -0.118810 -0.252211 -0.212746 -0.208348 -0.081288 0.026263 0.152821 0.025154 0.470631 0.077842 -0.138938 -0.059859 0.235020 -0.084926 -0.070127 0.376334 -0.040150
polarizability: 2.35098110e+02 -5.47716696e+00 1.51252049e+02 1.47657146e+01 1.16785482e+01 9.31605084e+01
1716.lowfreq: -8.3876 -6.4294 0.0009 0.0009 0.0010 9.4019 20.5305 29.5994 40.5780
frequency: 20.0988 29.5585 40.5412 51.9351 57.5964 71.6436 81.2503 101.9680 144.7520 157.4305 169.0075 239.7411 252.2363 258.3323 285.7230 306.7444 338.4094 357.8712 397.9506 411.3891 428.4601 454.0453 484.4526 514.6065 525.2787 573.9743 604.0635 624.9650 626.4716 657.5764 674.0887 678.5734 741.1763 770.5297 821.3456 860.8397 866.3382 883.4524 890.1108 953.7666 986.3520 993.6233 1004.1542 1007.5851 1012.3746 1027.2130 1039.4046 1069.5138 1091.3512 1109.7741 1119.0962 1150.9759 1174.3508 1179.8956 1208.4183 1220.0457 1230.7888 1241.3071 1277.5209 1297.6700 1312.3782 1331.2779 1358.0075 1375.5749 1387.4172 1398.5434 1405.6797 1423.6618 1449.1070 1459.8149 1470.6641 1477.7004 1480.7099 1596.6836 1609.5910 1621.6966 2974.9382 2980.3593 2997.6337 3041.2834 3043.0716 3096.7286 3104.3875 3134.6906 3168.8443 3182.4508 3187.2664 3524.3003 3529.8612 3592.6024
redmass: 6.0746 5.0351 4.7514 2.9236 1.9123 5.7318 3.1504 4.1729 7.1056 6.2975 5.0269 5.1755 5.4144 4.6532 4.9772 1.1391 3.7992 3.5426 1.1780 2.8655 3.5370 3.6563 7.0259 4.4230 4.0789 3.2935 3.9249 4.6214 4.9295 5.7526 4.3806 1.3103 4.5336 6.7716 4.3739 1.3504 1.9172 2.1922 2.9910 3.0592 1.7479 1.5555 1.6570 2.2113 4.1886 3.0561 1.6569 2.2331 3.3494 1.3200 2.3799 1.2698 1.2795 1.5009 1.3386 5.3537 1.2616 1.7088 1.4199 1.2945 1.4921 1.3237 3.9541 2.6381 1.2263 1.4103 5.9315 2.8731 1.0656 1.4302 1.2834 1.1409 2.2464 7.7551 6.2353 6.7971 1.0840 1.0567 1.0362 1.1070 1.0851 1.0988 1.1000 1.0908 1.0889 1.0944 1.0968 1.0759 1.0661 1.0669
irintensity: 0.5132 2.6770 0.5327 0.4858 6.2708 1.7042 2.4327 5.8939 3.6649 4.2946 6.8700 6.7990 2.6698 15.8412 1.7181 148.1263 3.1740 5.3702 92.8360 2.0708 18.5904 1.8497 2.6520 6.5951 11.2179 22.3571 10.5549 6.2265 10.3044 15.4641 58.4889 110.6453 5.9716 24.7119 9.1991 14.2789 20.3662 30.8951 21.9592 8.9868 6.0964 5.7494 8.3047 7.9048 41.7478 49.2377 15.7694 40.6733 19.1023 15.5353 27.7566 50.4833 25.2432 54.9241 12.1554 417.4370 9.3613 42.1629 62.8183 3.8879 68.4695 12.4710 40.2545 79.9198 72.4955 1.7950 7.8750 29.0923 32.3986 219.9082 76.4175 15.3851 2.7831 1.4939 56.9547 164.3593 25.6913 37.2452 9.5234 41.1613 21.1838 11.5744 13.4042 5.3757 0.5760 0.8619 1.0356 24.5892 22.8366 9.6815
temp: 298.150 k
press: 1.00000 atm
elementType: 8 8 8 8 8 7 7 6 6 6 6 6 6 6 6 6 6 6 1 1 1 1 1 1 1 1 1 1 1 1 1 1
symmnumber: 1
zpe: 643391.4 jmol-1
zpe.correction: 0.245055 hartree
zpe.thermalcorrener: 0.263336 hartree
zpe.thermalcorrenthalpy: 0.264280 hartree
zpe.thermalcorrgfe: 0.195884 hartree
zpe.sumelectzpe: -911.757997 hartree
zpe.sumelectthermal: -911.739716 hartree
zpe.sumelectthermalent: -911.738772 hartree
zpe.sumelectthermalfe: -911.807168 hartree
dipole: 7.2421 5.2140 0.5145
dipole: 8.9386
quadrupole: -126.5361 -100.3468 -109.0531
quadrupole: 9.4539 1.3507 -5.7377
quadrupole: -14.5574 11.6319 2.9255 9.4539 1.3507 -5.7377
hfenergy: -912.0030518 hartree
pointgroup: C01 [X(C11H14N2O5)]
dipole: -2.8218844 -2.0980797 -0.0480405 debye
polarizability: 233.6538405|-1.5744003|153.4349701|-21.3402926|-1.0079484|92.4218573 unknown
InChI: InChI=1S/C11H14N2O5/c1-7(15)12-10(6-14)11(16)8-2-4-9(5-3-8)13(17)18/h2-5,10-12,14,16H,6H2,1H3
charge 0 multiplicity 1
32 atoms
O  -1.385278 0.933704 1.856693
O  -1.939396 -2.625891 -0.410871
O  -3.957661 1.768042 -0.759471
O  5.245269 -0.719357 -0.688018
O  5.02821 1.551021 -0.659798
N  -3.364777 -0.279679 0.18635
N  4.554729 0.358719 -0.508777
C  -1.958015 -0.22669 -0.252298
C  -1.023212 -0.204084 1.010044
C  0.44217 -0.05327 0.639098
C  -1.667247 -1.400072 -1.195408
C  1.250793 -1.203358 0.448099
C  1.006599 1.235676 0.463155
C  -4.29479 0.704443 -0.160452
C  2.601288 -1.078784 0.070725
C  2.355468 1.379929 0.086445
C  3.133579 0.217127 -0.109532
C  -5.735676 0.409698 0.242446
H  -1.835753 0.728485 -0.796297
H  -1.171485 -1.159314 1.555156
H  -0.614173 -1.374596 -1.534614
H  -2.338857 -1.338161 -2.074568
H  -3.688534 -1.188269 0.530849
H  0.816392 -2.197723 0.604544
H  0.381671 2.112765 0.652431
H  -2.376442 0.972996 1.90009
H  3.245158 -1.949426 -0.077751
H  2.813843 2.362465 -0.053359
H  -1.88255 -3.420699 -0.99577
H  -6.127182 1.25831 0.828546
H  -6.355975 0.332675 -0.667759
H  -5.848566 -0.516182 0.832074
