program: Gaussian 09
title: 000233909
version: EM64L-G09RevD.01
frameworkgroup: C1[X(C18H16N2O2)]
method: RPBEPBE
basis: SDD
operation: Freq
keyword: #p
keyword: freq=noraman
keyword: PBEPBE/SDD
title: #p freq=noraman PBEPBE/SDD
converged: NO YES NO NO
title: Mulliken charges:
elementType: O O N N C C C C C C C C C C C C C C C C C C H H H H H H H H H H H H H H H H
charge: -0.286179 -0.240237 -0.196685 -0.009094 -0.192014 -0.281026 0.181981 -0.372061 0.540050 0.381108 -0.422799 -0.446266 -0.346596 -0.383190 -0.365503 -0.219656 -0.236608 -0.228964 -0.229498 -0.231944 -0.240642 -0.141676 0.228129 0.256189 0.271927 0.254684 0.247879 0.288762 0.233873 0.256001 0.275322 0.262453 0.233940 0.236251 0.228795 0.228503 0.235797 0.228994
chargesum: 0.00000
title: Mulliken charges with hydrogens summed into heavy atoms:
elementType: O O N N C C C C C C C C C C C C C C C C C C
charge: -0.286179 -0.240237 -0.196685 -0.009094 0.036115 -0.024837 0.181981 0.154551 0.540050 0.381108 0.113841 -0.212393 -0.090594 -0.107868 -0.103050 0.014284 -0.000357 -0.000169 -0.000995 0.003852 -0.011647 -0.141676
polarizability: 2.37664312e+02 1.51191115e+01 2.20465333e+02 2.37180712e+01 -2.18715636e+00 1.44154571e+02
1716.lowfreq: -8.2697 -0.0009 -0.0006 0.0005 3.6377 8.7135 17.1488 17.8468 19.9977
frequency: 16.2322 17.5445 19.2720 33.3652 49.3822 52.7649 68.2566 106.0429 116.3251 155.7608 178.6805 197.4886 240.4890 245.5283 268.3115 297.1953 366.8808 377.1229 393.5994 402.4793 405.2746 441.9231 468.7212 516.6390 526.0038 588.2260 610.6591 614.3547 615.8240 633.9451 654.6575 702.4738 704.7191 719.3917 744.3254 766.7178 783.3188 809.3497 835.2294 855.6595 861.7040 872.0626 895.1909 934.1542 936.0514 944.0847 976.6393 981.6346 984.5222 990.1754 991.2280 994.6911 999.6388 1003.8671 1013.3774 1026.7765 1029.2566 1075.8673 1084.2474 1087.8443 1149.1163 1171.7649 1175.7276 1186.4062 1189.4426 1200.1784 1211.1367 1221.9861 1243.3652 1250.9431 1268.1652 1280.9890 1303.8578 1315.6728 1321.8079 1357.1962 1364.1602 1382.3198 1385.1359 1396.7426 1434.9405 1449.3144 1449.8626 1460.6001 1481.4406 1484.6155 1592.2404 1598.9033 1612.2754 1613.9794 1641.7117 2201.3725 2945.8562 2980.2565 3002.4576 3028.2922 3060.4297 3098.6844 3116.8477 3124.8869 3130.7270 3135.4416 3140.8716 3148.3886 3153.1408 3160.6631 3168.3606 3170.8815
redmass: 4.0166 4.8818 5.0772 7.5416 3.8173 3.2056 6.3404 5.8027 6.0421 6.4971 5.5312 5.3869 3.9482 4.3087 5.4942 4.9921 6.1576 3.8291 4.9656 2.9525 2.8959 4.0513 6.0602 4.7545 4.4466 5.0276 6.2388 6.4651 6.3849 7.9445 6.9683 2.6043 1.9252 1.9920 1.7025 1.6119 1.9736 4.7804 3.7100 1.2515 1.2657 3.4848 4.5732 1.4988 1.5318 4.5992 5.1820 1.4275 1.4962 4.2713 6.1494 3.1622 1.3310 1.3291 4.3514 2.1753 2.1501 2.4531 1.6950 1.6610 2.0537 1.0568 1.0559 1.1380 1.1182 1.9396 1.9717 1.5823 1.4162 1.5943 1.4717 1.3300 1.4675 1.6858 1.3006 1.4558 1.3134 6.7537 3.0666 3.7045 2.2187 1.4910 1.3701 1.0985 2.2584 2.2961 6.2566 6.0148 5.9652 5.9984 10.1834 12.4390 1.0857 1.0833 1.0590 1.0592 1.1017 1.1063 1.0887 1.0849 1.0862 1.0888 1.0909 1.0937 1.0960 1.0972 1.1014 1.0982
irintensity: 0.3150 0.0697 0.4589 0.1493 1.9368 3.5067 3.7875 2.5997 4.4388 5.3200 0.8623 1.2631 2.6748 2.4976 7.5505 6.9043 2.8164 1.7297 4.6255 0.2534 0.3236 1.0639 2.8028 27.7163 11.5455 11.4840 16.9171 0.7390 5.3733 3.0795 12.7206 46.5319 41.3786 6.1941 77.1990 59.3237 15.3254 9.5500 7.0871 0.0851 0.4487 10.4205 8.5744 4.2997 1.5072 2.2647 56.5878 0.1844 1.7219 0.3655 1.3787 59.6229 1.1340 0.1463 3.7997 2.7633 5.9313 11.7447 3.5321 7.4177 45.7517 0.2292 0.1886 9.5609 0.9647 3.4427 22.5426 7.0260 77.5221 29.8139 3.5689 2.7577 32.4842 104.2781 6.1944 19.6970 34.5547 23.6146 135.6870 7.6565 17.5277 13.2809 16.2024 24.7698 19.7275 2.5526 0.0356 0.8987 6.4754 0.8147 253.2609 14.2366 59.8566 21.1286 4.3157 12.0926 1.4255 3.8997 7.4143 0.0715 0.3232 10.5324 8.4587 19.9713 28.8793 20.9027 19.2514 12.7274
temp: 298.150 k
press: 1.00000 atm
elementType: 8 8 7 7 6 6 6 6 6 6 6 6 6 6 6 6 6 6 6 6 6 6 1 1 1 1 1 1 1 1 1 1 1 1 1 1 1 1
symmnumber: 1
zpe: 779048.3 jmol-1
zpe.correction: 0.296724 hartree
zpe.thermalcorrener: 0.316064 hartree
zpe.thermalcorrenthalpy: 0.317008 hartree
zpe.thermalcorrgfe: 0.244253 hartree
zpe.sumelectzpe: -953.899937 hartree
zpe.sumelectthermal: -953.880598 hartree
zpe.sumelectthermalent: -953.879653 hartree
zpe.sumelectthermalfe: -953.952408 hartree
dipole: -1.2909 3.9107 1.5981
dipole: 4.4174
quadrupole: -143.8193 -127.2009 -127.8387
quadrupole: 15.1797 17.2025 -11.2537
quadrupole: -10.8664 5.7521 5.1143 15.1797 17.2025 -11.2537
hfenergy: -954.196661 hartree
pointgroup: C01 [X(C18H16N2O2)]
dipole: 0.3748492 1.4636814 -0.8588381 debye
polarizability: 237.8842178|-8.4054036|216.883002|30.153971|-7.5311839|147.5169966 unknown
InChI: InChI=1S/C18H16N2O2/c19-12-7-13-20-17(21)16(14-8-3-1-4-9-14)22-18(20)15-10-5-2-6-11-15/h1-6,8-11,16,18H,7,13H2
charge 0 multiplicity 1
38 atoms
O  0.568125 -0.053969 -1.672183
O  0.565591 -2.675478 0.835979
N  -0.849829 -1.048928 -0.110789
N  -5.039719 -3.158729 1.356227
C  -0.839587 -0.037101 -1.188524
C  1.352508 -1.074581 -0.943998
C  0.352757 -1.720509 0.040668
C  -2.043583 -1.396227 0.661467
C  -1.259978 1.351007 -0.736826
C  2.576559 -0.470744 -0.255578
C  -2.795775 -2.60992 0.029292
C  -2.259912 2.045957 -1.45611
C  -0.658513 1.961012 0.393242
C  2.887993 0.901578 -0.401789
C  3.422439 -1.307123 0.516463
C  -2.659408 3.341611 -1.055539
C  -1.057018 3.252538 0.794439
C  4.038178 1.435608 0.22368
C  4.566954 -0.767296 1.143176
C  -2.058604 3.945904 0.071455
C  4.88015 0.604863 0.997493
C  -4.035711 -2.923938 0.755672
H  -1.48388 -0.360152 -2.034773
H  1.672205 -1.846001 -1.673356
H  -1.725795 -1.666504 1.683157
H  -2.704558 -0.515218 0.720608
H  -3.045987 -2.397655 -1.027355
H  -2.128384 -3.491029 0.046496
H  -2.722014 1.577866 -2.334769
H  0.119926 1.427354 0.950936
H  2.234278 1.532341 -1.011593
H  3.171431 -2.365904 0.643605
H  -3.433415 3.874934 -1.617781
H  -0.589791 3.720711 1.667573
H  4.276699 2.498275 0.101875
H  5.212917 -1.417015 1.74415
H  -2.36661 4.949255 0.385656
H  5.771759 1.020109 1.480653
