program: Gaussian 09
title: 000233901
version: EM64L-G09RevD.01
frameworkgroup: C1[X(C6H5F3N2O)]
method: RPBEPBE
basis: SDD
operation: Freq
keyword: #p
keyword: freq=noraman
keyword: PBEPBE/SDD
title: #p freq=noraman PBEPBE/SDD
converged: NO NO NO NO
title: Mulliken charges:
elementType: F F F O N N C C C C C C H H H H H
charge: -0.133858 -0.155889 -0.155918 -0.197661 -0.408601 0.010503 0.343807 0.149190 -0.368883 0.263861 0.016104 -0.767812 0.347764 0.285123 0.290685 0.240797 0.240789
chargesum: 0.00000
title: Mulliken charges with hydrogens summed into heavy atoms:
elementType: F F F O N N C C C C C C
charge: -0.133858 -0.155889 -0.155918 -0.197661 -0.060837 0.010503 0.343807 0.149190 -0.083760 0.263861 0.016104 0.004459
polarizability: 9.27299668e+01 -8.89218651e+00 1.07340852e+02 -1.01284225e-03 -1.51027036e-03 4.61438887e+01
1716.lowfreq: -9.7625 -0.0010 -0.0001 0.0009 2.1530 7.6160 21.7064 73.3316 102.4312
frequency: 20.1165 73.3197 102.4207 104.3941 145.4031 199.9979 273.3866 289.6144 309.4127 347.1033 448.2005 461.6181 533.6600 538.3829 567.2552 577.8476 597.5731 630.2877 665.8271 738.9808 805.5832 892.1132 897.4899 944.1731 982.4875 1012.2987 1049.7468 1066.2214 1085.7528 1142.6525 1236.4073 1267.9821 1360.9407 1395.6679 1428.6449 1464.9848 1469.4048 1577.2872 1615.2725 1647.9432 2989.2867 3069.2829 3144.2627 3199.2627 3537.6408
redmass: 10.9312 1.0867 5.4211 5.4887 7.6329 4.0638 5.9459 10.2660 6.8028 7.4583 14.8956 10.2565 8.6853 6.0061 5.9201 2.9081 1.2903 13.6790 11.2593 3.6894 7.3655 5.6663 1.5594 2.7144 9.2346 4.4438 1.5657 2.7836 5.2530 5.6472 1.9524 2.7901 2.2371 1.2655 2.3144 1.3638 1.0441 5.1029 6.5356 7.8380 1.0396 1.0980 1.0971 1.0942 1.0789
irintensity: 2.7554 0.3985 2.9165 1.6920 8.3400 2.8699 2.4496 3.0305 1.0479 7.1178 0.0556 3.0869 2.4830 1.1980 3.2693 5.1261 68.7232 8.0092 0.0175 0.3204 22.3492 23.7515 86.2434 38.9149 225.9413 80.7254 6.3557 22.3626 106.9424 118.8612 101.5625 97.0971 153.3863 49.1795 55.5753 18.8171 21.5076 372.9599 40.0095 157.0785 8.5264 11.1883 1.3407 3.0597 82.4523
temp: 298.150 k
press: 1.00000 atm
elementType: 9 9 9 8 7 7 6 6 6 6 6 6 1 1 1 1 1
symmnumber: 1
zpe: 286551.0 jmol-1
zpe.correction: 0.109142 hartree
zpe.thermalcorrener: 0.120272 hartree
zpe.thermalcorrenthalpy: 0.121217 hartree
zpe.thermalcorrgfe: 0.070503 hartree
zpe.sumelectzpe: -715.005618 hartree
zpe.sumelectthermal: -714.994487 hartree
zpe.sumelectthermalent: -714.993543 hartree
zpe.sumelectthermalfe: -715.044256 hartree
dipole: 1.9847 -5.6507 -0.0004
dipole: 5.9891
quadrupole: -85.2024 -66.0449 -68.5917
quadrupole: 14.5192 -0.0001 -0.0029
quadrupole: -11.9227 7.2347 4.6880 14.5192 -0.0001 -0.0029
hfenergy: -715.1147594 hartree
pointgroup: C01 [X(C6H5F3N2O1)]
dipole: -0.8333657 2.2039696 0.0128396 debye
dipolederiv: -0.5419048 -0.2181526 -0.000025 -0.2070904 -0.6137141 -0.0009894 0.0001044 -0.0009187 -0.2662394 -0.579613 0.143953 0.1639751 0.1512005 -0.4246108 -0.2230336 0.1737632 -0.2083745 -0.6280102 -0.5822362 0.1472353 -0.1629055 0.1547208 -0.4289907 0.2238492 -0.1724796 0.2091443 -0.6209765 -0.636942 0.3540825 0.0025836 0.2982368 -0.9935836 -0.0038491 0.0023948 -0.0041498 -0.3615923 -0.9021285 -0.2426988 0.0017574 0.0587724 -0.8620568 -0.0032039 0.0032163 -0.0021052 -0.1895657 -0.3987588 -0.0629743 0.0002664 0.1674308 -1.2176868 -0.0048288 0.0012194 -0.0038454 -0.2585634 -0.1990263 0.2552326 0.0015021 0.0309145 0.7322993 0.0036383 0.0004124 0.0028091 -0.10565 1.06244 -0.0524144 -0.0041644 -0.0533547 0.9922369 0.0042331 -0.0042172 0.0042226 0.0814398 -0.4325446 0.3441602 0.0028541 -0.0531914 -0.2342394 -0.0003089 0.0010021 -0.0018802 -0.1013977 1.9454593 -0.2086129 -0.002408 -0.0682194 1.3952964 -0.0005125 -0.0019396 0.000091 1.5674258 0.9255099 -0.3843194 -0.0042349 -0.3115613 1.4390475 0.0061929 -0.0038349 0.0065413 0.2551372 -0.0740708 -0.0636039 0.0001868 -0.1506905 -0.2784106 -0.0008108 -0.0002149 -0.0012077 0.0401727 0.2112917 -0.0033569 0.0004391 -0.0124283 0.2452462 -0.0003135 0.0004136 -0.0003214 0.3241464 0.0648186 -0.0416163 0.0002042 -0.0548444 0.0860097 -0.000153 0.0000997 -0.0001928 0.1670208 -0.0199645 -0.0137722 0.0005895 0.0625306 0.1111114 -0.0003726 0.0009268 -0.0000473 0.1367714 0.079396 0.0226534 0.0827181 -0.0067082 0.0267462 -0.0648168 0.0507248 -0.0977398 -0.0213372 0.0782739 0.0242046 -0.0833387 -0.0057176 0.0252991 0.0652795 -0.0515915 0.0979745 -0.018782 unknown
polarizability: 93.1593982|-9.2278329|106.9091711|-0.2272611|0.3051257|46.1461384 unknown
InChI: InChI=1S/C6H5F3N2O/c1-3-10-4(6(7,8)9)2-5(12)11-3/h2,10H,1H3
charge 0 multiplicity 1
17 atoms
F  -2.671998 -1.238003 0.004938
F  -2.50756 0.725667 1.145738
F  -2.516625 0.737187 -1.117191
O  2.300061 -2.356824 -0.018792
N  0.155071 1.11464 0.004884
N  2.275852 -0.000299 -0.008677
C  -0.53666 -0.096688 0.002128
C  1.56186 1.108252 -0.000854
C  0.14387 -1.286379 -0.005965
C  -2.038004 0.010277 0.008707
C  1.627298 -1.291048 -0.011616
C  2.224654 2.464565 0.002464
H  -0.34889 2.004364 0.010941
H  -0.383706 -2.242325 -0.008329
H  3.313447 2.320184 -0.002669
H  1.946879 3.046277 0.901349
H  1.939449 3.054251 -0.888858
