program: Gaussian 09
title: 000233891
version: EM64L-G09RevD.01
frameworkgroup: C1[X(C5H4F3N3O)]
method: RPBEPBE
basis: SDD
operation: Freq
keyword: #p
keyword: freq=noraman
keyword: PBEPBE/SDD
title: #p freq=noraman PBEPBE/SDD
converged: NO NO NO NO
title: Mulliken charges:
elementType: F F F O N N N C C C C C H H H H
charge: -0.134845 -0.159794 -0.159595 -0.215078 -0.440929 -0.029639 -0.622490 0.362977 0.273247 -0.377321 0.163042 0.036592 0.335124 0.282937 0.365050 0.320722
chargesum: 0.00000
title: Mulliken charges with hydrogens summed into heavy atoms:
elementType: F F F O N N N C C C C C
charge: -0.134845 -0.159794 -0.159595 -0.215078 -0.105805 -0.029639 0.063282 0.362977 0.273247 -0.094384 0.163042 0.036592
polarizability: 9.03727069e+01 6.44388048e+00 1.08352372e+02 8.60092831e-04 5.15651835e-04 4.01986072e+01
1716.lowfreq: -12.3785 -5.2270 -0.0013 -0.0011 -0.0008 8.9714 17.3405 90.0676 104.2806
frequency: 8.6997 90.0352 104.2782 148.1500 194.5938 259.8454 281.1898 290.2548 321.2843 357.8020 447.2037 465.9334 514.8112 537.1356 545.1883 560.3700 581.0837 636.0402 641.1243 687.7885 732.3652 816.1470 888.0776 922.1001 944.8923 977.1025 1024.4187 1084.1619 1105.4154 1202.9922 1239.6058 1331.0525 1408.3528 1435.5079 1577.0938 1601.2877 1646.3952 1655.7693 3204.2231 3542.3958 3549.8054 3698.3960
redmass: 10.5684 3.5165 9.8653 8.9961 5.6014 1.3541 9.7264 5.3875 8.2264 5.5286 15.8177 10.5020 1.1945 9.6956 6.5256 1.1667 5.6800 13.8558 8.9232 5.8151 5.2906 7.3004 1.5376 5.7536 3.0817 9.2940 4.8924 6.8910 1.9512 7.7658 1.9494 1.6517 4.9474 4.7556 6.4730 1.4030 3.2622 6.2664 1.0942 1.0695 1.0544 1.1053
irintensity: 3.4226 0.4841 4.1269 10.0540 7.6953 23.1905 3.5472 13.5737 0.5058 4.2619 0.1485 2.7408 299.8521 3.5002 2.0582 60.6265 8.4746 6.4390 12.4951 11.6086 6.9939 27.0899 88.1113 34.4498 31.8173 236.7239 86.0431 79.0701 56.3315 255.5779 55.0897 58.0358 126.2968 130.6049 566.3485 0.9785 165.1733 369.1227 3.7052 50.5646 116.8287 50.1969
temp: 298.150 k
press: 1.00000 atm
elementType: 9 9 9 8 7 7 7 6 6 6 6 6 1 1 1 1
symmnumber: 1
zpe: 258754.5 jmol-1
zpe.correction: 0.098554 hartree
zpe.thermalcorrener: 0.109493 hartree
zpe.thermalcorrenthalpy: 0.110437 hartree
zpe.thermalcorrgfe: 0.059868 hartree
zpe.sumelectzpe: -731.059310 hartree
zpe.sumelectthermal: -731.048371 hartree
zpe.sumelectthermalent: -731.047427 hartree
zpe.sumelectthermalfe: -731.097996 hartree
dipole: -1.4829 -7.1291 -0.0005
dipole: 7.2817
quadrupole: -82.1419 -59.6502 -69.8625
quadrupole: -17.9377 0.0065 -0.0040
quadrupole: -11.5903 10.9013 0.6890 -17.9377 0.0065 -0.0040
hfenergy: -731.1578639 hartree
pointgroup: C01 [X(C5H4F3N3O1)]
dipole: -0.6904596 2.7803748 0.001731 debye
dipolederiv: -0.5222803 -0.214229 0.0006479 -0.20286 -0.6242119 0.0012465 0.0002776 0.0011157 -0.266758 -0.6053877 0.139783 0.1742372 0.1585602 -0.4212203 -0.2213751 0.1924842 -0.203814 -0.6296353 -0.605851 0.1392641 -0.1747836 0.1579085 -0.419073 0.2201734 -0.1937594 0.2030302 -0.631401 -0.6688672 0.3899905 0.0002449 0.2450508 -1.0465163 -0.0003712 0.0001723 -0.0003165 -0.3740297 -0.9134716 -0.4061353 -0.0001771 0.1414379 -0.8380976 -0.0000429 -0.0001627 0.0004974 -0.2262768 -0.4674728 0.0962065 0.0001913 -0.0127301 -1.6153363 -0.0006624 0.0001478 -0.000389 -0.309457 -0.456135 -0.5025279 -0.0000512 -0.4719715 -1.2949655 -0.0007708 -0.0003054 -0.0015153 -0.7424891 -0.2523454 0.28184 0.0003634 0.0242258 0.76081 0.0003626 0.0009829 0.0001166 -0.1079551 1.9954725 -0.1860145 -0.0002354 -0.0586928 1.3841285 -0.000124 0.0006089 -0.0001145 1.5749063 -0.4279727 0.2482183 0.0001223 -0.0772088 -0.2329644 0.0000627 0.0000357 -0.0003126 -0.1025686 1.2435717 0.2246775 -0.000359 0.2585221 1.959943 0.001017 -0.000584 0.0009382 0.2652158 1.0352611 -0.2738327 -0.0002775 -0.1744114 1.6602642 0.0006079 -0.0002939 0.0005429 0.2362107 0.176722 -0.0149072 0.0000839 -0.0171041 0.2056304 -0.0001874 0.0002671 -0.000531 0.3426727 0.0653886 -0.0411342 0.0000156 -0.0603946 0.0826863 -0.0000536 -0.0000671 -0.0000168 0.1710278 0.2605544 0.0906736 0.0001024 0.0461712 0.2065095 0.0000191 0.0001996 0.0001 0.4001963 0.1428135 0.0281274 -0.0001251 0.0434969 0.2324132 0.0000982 -0.0000037 0.0006688 0.4003409 unknown
polarizability: 90.8925952|-7.1134151|107.8324627|-0.0133999|0.0358779|40.1986281 unknown
InChI: InChI=1S/C5H4F3N3O/c6-5(7,8)2-1-3(12)11-4(9)10-2/h1,10H,9H2
charge 0 multiplicity 1
16 atoms
F  -2.629128 -1.31708 0.00337
F  -2.54541 0.660695 1.129038
F  -2.54575 0.65483 -1.132254
O  2.381962 -2.245661 -0.001636
N  0.095344 1.152284 0.000791
N  2.264487 0.10294 -0.000945
N  2.086796 2.433778 0.000668
C  -0.538787 -0.096742 0.000217
C  -2.040838 -0.046881 0.000115
C  0.189554 -1.253993 -0.000727
C  1.501624 1.186266 0.000062
C  1.679173 -1.196471 -0.001262
H  -0.460605 2.009306 0.002746
H  -0.295525 -2.231738 -0.001106
H  3.1045 2.452642 0.000341
H  1.565602 3.306925 -0.000114
