program: Gaussian 09
title: 000233887
version: EM64L-G09RevD.01
frameworkgroup: C1[X(C9H11N5)]
method: RPBEPBE
basis: SDD
operation: Freq
keyword: #pfreq=noraman
keyword: PBEPBE/SDD
title: #p freq=noraman PBEPBE/SDD
converged: YES YES NO NO
title: Mulliken charges:
elementType: N N N N N C C C C C C C C C H H H H H H H H H H H
charge: -0.094514 -0.153090 -0.037423 -0.064930 -0.029616 -0.396690 -0.399138 0.108608 -0.099296 0.134918 -0.340746 -0.237316 -0.382409 -0.659485 0.242870 0.248888 0.244808 0.245778 0.212917 0.250121 0.265845 0.242990 0.255226 0.221775 0.219910
chargesum: 0.00000
title: Mulliken charges with hydrogens summed into heavy atoms:
elementType: N N N N N C C C C C C C C C
charge: -0.094514 -0.153090 -0.037423 -0.064930 -0.029616 0.095068 0.091449 0.108608 -0.099296 0.134918 0.122292 0.028529 -0.139420 0.037426
polarizability: 1.89031434e+02 -1.46550106e+00 1.37946846e+02 -3.17543460e+00 1.74115454e+00 7.19284322e+01
1716.lowfreq: -11.0302 -5.8652 -0.0003 0.0004 0.0005 6.2197 22.2196 59.3564 76.7922
frequency: 21.6611 59.3548 76.7836 126.0731 141.8707 186.3964 196.3677 229.2728 268.4135 296.9104 358.3888 409.3342 435.8247 513.8740 563.4577 590.1977 640.4643 654.3688 667.6508 695.6320 786.1806 787.2704 790.6574 803.7370 825.3441 865.4789 922.3614 927.0260 950.3152 992.7778 1008.8641 1065.3456 1091.8233 1095.9315 1103.5044 1107.9584 1120.3673 1140.9830 1172.1996 1202.1329 1210.5124 1259.0337 1293.6181 1308.5333 1341.0625 1356.1374 1367.3808 1389.8608 1390.3482 1428.9083 1461.9920 1464.4957 1468.7041 1476.7972 1486.4301 1490.5309 1536.7143 1573.8680 2991.6866 3018.6315 3073.6601 3079.8695 3087.5990 3091.8381 3106.8772 3163.3203 3183.2746 3199.0978 3224.0844
redmass: 2.4852 3.7886 3.3857 4.6481 2.5557 2.2877 2.5029 3.9878 1.6066 5.6649 4.4602 3.9790 6.8283 4.2462 3.8355 6.2515 5.2985 5.7175 7.0782 5.3320 1.1859 1.3959 2.3086 5.2304 1.8386 5.8060 6.1852 1.4550 2.6746 1.3411 2.0966 2.0759 1.9234 1.3440 1.4937 2.6132 1.4588 1.7621 3.7103 2.6628 1.8525 1.9242 6.7376 5.8018 1.8381 1.5640 3.1669 1.5227 1.3894 3.1876 1.4688 1.1229 1.0850 1.3552 1.0696 2.0603 7.1520 10.8205 1.0355 1.0601 1.1034 1.0485 1.0605 1.0998 1.1027 1.0919 1.1188 1.1175 1.0981
irintensity: 0.2751 4.0458 4.5626 5.3872 1.4277 4.5016 8.9845 0.7282 1.7105 9.0366 5.8359 1.2780 4.2635 2.7486 4.2074 5.9378 23.1501 4.1797 6.6804 6.9267 17.0654 29.0712 14.5580 0.6008 10.8680 4.6418 5.9812 12.4875 46.4450 5.5302 13.8033 9.5669 6.3253 6.9099 2.1852 8.5529 26.2233 0.1211 24.4808 11.2092 56.2548 2.4448 64.1666 65.9431 59.4034 0.8521 27.4406 9.8111 11.6926 117.1268 25.5330 12.7191 12.3004 28.7793 19.6625 12.4437 73.3080 627.7823 22.9514 33.9783 2.4515 17.8360 44.8346 38.3841 24.5111 19.7051 0.8912 26.8628 0.3526
temp: 298.150 k
press: 1.00000 atm
elementType: 7 7 7 7 7 6 6 6 6 6 6 6 6 6 1 1 1 1 1 1 1 1 1 1 1
symmnumber: 1
zpe: 516891.0 jmol-1
zpe.correction: 0.196873 hartree
zpe.thermalcorrener: 0.209114 hartree
zpe.thermalcorrenthalpy: 0.210058 hartree
zpe.thermalcorrgfe: 0.156982 hartree
zpe.sumelectzpe: -622.249585 hartree
zpe.sumelectthermal: -622.237344 hartree
zpe.sumelectthermalent: -622.236400 hartree
zpe.sumelectthermalfe: -622.289476 hartree
dipole: 1.9613 -1.9981 1.5646
dipole: 3.2074
quadrupole: -62.0936 -85.7431 -82.7382
quadrupole: -1.9408 -4.5877 -0.0099
quadrupole: 14.7647 -8.8848 -5.8799 -1.9408 -4.5877 -0.0099
hfenergy: -622.4464581 hartree
pointgroup: C01 [X(C9H11N5)]
dipole: -0.7522876 -0.60266 -0.8143585 debye
dipolederiv: -1.7701653 0.535097 0.3002849 0.9468348 -0.3657656 -0.0389906 -0.1835963 0.1344971 -0.4226649 -0.8248131 -0.0736723 -0.0898999 0.2090125 -0.4234454 -0.0030083 0.0165609 -0.0267296 -0.183134 -0.8067983 0.1191248 0.0416791 0.6293196 -0.7115509 -0.1343401 0.1277094 -0.095403 -0.2447764 -0.6305966 0.0215866 -0.0385915 -0.0075799 -0.3728695 -0.0342007 -0.0110365 -0.0168116 -0.2369992 -0.7698096 -0.0561337 -0.0174779 -0.07115 -0.5922359 -0.1201598 -0.0469125 -0.0821063 -0.2204875 0.4752379 -0.0395386 0.0114693 -0.0698718 0.0540142 -0.0494275 0.031065 -0.0829449 0.2280405 0.3167675 -0.1788023 -0.0589246 -0.2999131 0.231243 -0.0216304 -0.0195682 -0.0382695 0.2434355 1.9213945 -0.4932381 -0.1375954 -0.8332894 0.6366878 0.114294 0.1335266 -0.0018373 0.1512364 -0.7781607 0.1608577 0.0459019 0.1235106 0.0914 0.014772 0.0296795 0.0135919 0.0218485 0.7154867 0.292878 0.0867016 0.1225179 0.360928 0.0992076 0.0612651 0.05532 0.1258531 0.7934644 -0.021151 0.0775083 -0.1009576 0.194024 -0.0511218 -0.0016369 -0.0535259 0.256704 0.4566308 -0.1975499 -0.0027266 -0.5309258 0.3308945 0.0396594 -0.11252 0.0736328 -0.0737088 0.8702196 -0.0309438 0.0076556 -0.1304924 0.537884 0.1330779 0.0047773 0.1180421 -0.0470102 -0.0778349 -0.0028921 -0.0280569 0.0284162 0.0188781 0.0628499 -0.0272774 0.0728911 -0.0467194 -0.100239 -0.0209549 -0.060193 -0.0801578 0.0876642 0.0266822 -0.1154349 0.0130517 0.0476046 0.0109156 0.0198477 -0.0352413 -0.0430207 -0.00459 0.1094606 0.0930992 0.0724137 0.0179952 0.0166099 0.0251096 -0.1003638 0.021231 0.0481092 -0.0093985 0.0251449 -0.0629817 -0.0638042 0.1011388 0.0399152 -0.0268054 0.1322441 -0.0836662 -0.0045217 -0.0278158 0.0365455 0.056452 -0.0352413 -0.0322252 0.0048015 -0.112917 -0.0914014 0.0887655 -0.0109741 0.0461377 0.0632837 0.0244193 0.0068995 -0.0327186 0.0973438 0.0401911 -0.0840242 0.0176687 -0.0533313 -0.0434387 0.0268566 -0.076951 -0.0123793 -0.0515816 0.056687 -0.0254313 -0.0061448 -0.0260005 0.1662202 0.0751102 0.0040396 0.0041007 0.0141824 -0.0920357 -0.0484401 -0.0028408 -0.0444916 0.1155054 0.0849615 -0.1031307 0.0320204 -0.0829624 -0.0357798 0.0506703 0.0294344 0.0156256 0.071686 -0.2057342 0.056625 -0.0087303 0.0759828 0.1019549 0.01006 -0.0120486 0.0039134 0.0782175 0.1101796 0.0452029 0.0375812 0.0142235 -0.0172196 -0.1248045 0.0078761 -0.0712293 -0.0613392 unknown
polarizability: 189.120043|0.9422288|134.8390545|1.4438123|14.0603899|74.9476148 unknown
InChI: InChI=1S/C9H11N5/c1-2-13-6-12-7-8(13)10-5-11-9(7)14-3-4-14/h5-6H,2-4H2,1H3
charge 0 multiplicity 1
25 atoms
N  2.682284 -0.309024 0.398758
N  -2.015727 -0.526332 0.180611
N  1.408287 1.675091 0.658004
N  -0.071316 -1.735797 -0.060523
N  -1.051575 1.710972 0.644757
C  3.927748 0.134397 -0.257042
C  3.255986 -1.200305 -0.632445
C  1.453641 0.324239 0.403171
C  0.229586 -0.389133 0.228392
C  -0.966811 0.37686 0.373239
C  -3.452754 -0.192205 0.195989
C  -1.417364 -1.768316 -0.08053
C  0.185078 2.280079 0.768433
C  -3.927676 0.426554 -1.134355
H  4.8249 0.130122 0.369622
H  3.8509 0.971134 -0.961232
H  2.734355 -1.262395 -1.594697
H  3.675237 -2.142872 -0.268268
H  -4.01097 -1.117657 0.424523
H  -3.616853 0.520043 1.023217
H  -2.01188 -2.660186 -0.27154
H  0.204437 3.353938 0.977205
H  -3.382062 1.363403 -1.337712
H  -5.006087 0.659996 -1.076027
H  -3.767262 -0.267505 -1.97825
