program: Gaussian 09
title: 000233874
version: EM64L-G09RevD.01
frameworkgroup: C1[X(C16H15NS)]
method: RPBEPBE
basis: SDD
operation: Freq
keyword: #p
keyword: freq=noraman
keyword: PBEPBE/SDD
title: #p freq=noraman PBEPBE/SDD
converged: YES YES NO NO
title: Mulliken charges:
elementType: S N C C C C C C C C C C C C C C C C H H H H H H H H H H H H H H H
charge: 0.217660 -0.032467 -0.240363 0.560936 0.528905 -0.690965 -0.690965 -0.458004 -0.408101 -0.390939 -0.384961 -0.373650 -0.338415 0.323562 -0.278402 -0.351184 -0.239038 -0.214045 0.211607 0.211489 0.214460 0.229248 0.229302 0.214501 0.211319 0.236319 0.232602 0.273467 0.231217 0.245547 0.258377 0.229927 0.231052
chargesum: 0.00000
title: Mulliken charges with hydrogens summed into heavy atoms:
elementType: S N C C C C C C C C C C C C C C C C
charge: 0.217660 -0.032467 -0.028755 0.560936 0.528905 -0.035768 -0.035842 -0.221685 -0.175499 -0.117472 -0.153743 -0.373650 -0.338415 0.323562 -0.032855 -0.092807 -0.009112 0.017007
polarizability: 3.88733247e+02 -5.35194180e+00 1.84379368e+02 -4.68146127e-02 -4.47970560e-02 9.32203960e+01
1716.lowfreq: -13.7418 -2.7344 -0.0021 -0.0017 -0.0013 2.3643 22.1020 36.8653 46.1416
frequency: 21.6808 36.5652 46.1077 73.5161 96.8046 178.0739 178.4580 192.5344 214.6129 216.3876 248.1178 288.1209 311.5340 327.9949 384.2947 392.5069 401.1299 439.2920 466.1758 487.2589 521.8575 541.7148 562.6989 608.0330 617.8138 621.2234 651.6261 681.6386 733.4185 739.5364 753.5771 766.4239 838.5419 843.0667 860.6707 863.8514 889.4008 905.5796 917.2859 946.6779 955.7154 964.0769 984.4954 990.0780 1010.1332 1015.3888 1042.7517 1052.1399 1110.9991 1115.4929 1117.1942 1155.8572 1168.9498 1189.5992 1200.9824 1223.1489 1254.0852 1292.4473 1295.7670 1308.3050 1328.1132 1375.1160 1376.7787 1384.9140 1395.6155 1415.7651 1431.5380 1444.1582 1467.3763 1467.9097 1479.6880 1480.3255 1492.1094 1532.7462 1564.5456 1571.3151 1605.7793 1619.2976 2975.2270 2978.0127 2983.0844 3068.3620 3075.7535 3078.7006 3082.9298 3119.2913 3121.7096 3135.8317 3142.6462 3150.1177 3164.5026 3165.2362 3175.1535
redmass: 3.3722 4.1886 3.8744 5.1083 4.3905 4.1051 3.4140 4.5827 3.8382 1.1011 1.1869 4.9023 4.5898 2.7548 4.4539 8.8148 2.8582 3.2520 3.1838 8.6250 3.9162 4.5849 2.9902 5.0207 4.7758 6.3901 7.7689 7.2002 2.5433 4.3063 3.5107 1.5897 1.3927 6.5647 1.4509 1.3990 2.5842 7.7992 1.1803 1.3832 1.4796 1.3750 1.3186 1.3775 2.9359 2.2216 5.0096 1.5680 2.5661 1.5287 1.5540 1.7504 1.1662 1.5849 1.6904 1.8931 1.8319 2.5788 1.6543 1.3215 1.6677 4.4628 1.1932 3.0002 1.2286 3.0845 2.9742 2.6223 1.0487 1.0466 1.0496 1.5799 1.5811 6.3131 6.1839 6.5081 7.1997 6.3842 1.0348 1.0352 1.0844 1.1001 1.0992 1.1006 1.0998 1.0868 1.0898 1.0856 1.0960 1.0903 1.0956 1.0949 1.0997
irintensity: 0.0047 0.6981 0.3074 0.5692 0.5089 0.0147 0.0718 2.2498 0.8840 0.0331 0.3799 0.1024 2.8055 1.6801 0.4374 0.8866 0.0279 6.6667 2.9368 0.7329 9.4832 1.2882 14.3023 13.9251 5.8055 8.2387 21.8017 1.6855 23.3566 4.4304 0.1507 77.8847 19.3131 1.8108 30.6608 6.4598 3.7405 64.9608 4.2168 2.9268 0.0209 0.1532 0.0411 0.5384 3.3421 13.4940 6.3252 54.9552 1.0370 14.8161 5.7866 2.4773 0.0472 29.8184 4.2693 4.8514 8.8859 12.7354 10.5720 0.6880 12.7995 11.5799 15.0900 2.9613 8.4598 15.2905 18.2827 4.4392 6.5169 0.0019 14.0410 34.5594 68.7466 30.0841 1.7056 2.3893 2.8067 39.6024 30.5509 46.2911 19.3437 0.2916 115.6353 24.0031 40.4883 18.4319 23.7982 2.1067 14.9503 9.3890 17.6079 4.3913 24.5708
temp: 298.150 k
press: 1.00000 atm
elementType: 16 7 6 6 6 6 6 6 6 6 6 6 6 6 6 6 6 6 1 1 1 1 1 1 1 1 1 1 1 1 1 1 1
symmnumber: 1
zpe: 688828.1 jmol-1
zpe.correction: 0.262361 hartree
zpe.thermalcorrener: 0.278328 hartree
zpe.thermalcorrenthalpy: 0.279273 hartree
zpe.thermalcorrgfe: 0.217509 hartree
zpe.sumelectzpe: -1070.272087 hartree
zpe.sumelectthermal: -1070.256119 hartree
zpe.sumelectthermalent: -1070.255175 hartree
zpe.sumelectthermalfe: -1070.316939 hartree
dipole: 1.0863 -0.4461 0.0010
dipole: 1.1744
quadrupole: -87.6518 -105.8654 -120.0701
quadrupole: 1.3233 -0.0090 -0.0255
quadrupole: 16.8773 -1.3363 -15.5410 1.3233 -0.0090 -0.0255
hfenergy: -1070.5344477 hartree
pointgroup: C01 [X(C16H15N1S1)]
dipole: -0.4296683 -0.1678907 -0.0259936 debye
polarizability: 388.8360092|2.5067817|182.4033215|1.2628205|12.9160151|95.0936804 unknown
InChI: InChI=1S/C16H15NS/c1-11(2)12-7-9-13(10-8-12)16-17-14-5-3-4-6-15(14)18-16/h3-11H,1-2H3
charge 0 multiplicity 1
33 atoms
S  1.624817 -1.762036 -0.260922
N  1.594088 0.912124 0.12249
C  -5.078057 0.34172 0.018803
C  -3.554069 0.209963 0.005086
C  -0.696796 -0.025307 -0.019004
C  -5.709544 -0.457011 1.190873
C  -5.699671 -0.085146 -1.3384
C  -2.722616 1.34796 0.175807
C  -2.924394 -1.050625 -0.178169
C  -1.319326 1.240902 0.165092
C  -1.52265 -1.169786 -0.190708
C  0.766635 -0.106299 -0.025845
C  3.187703 -0.864354 -0.1282
C  2.945836 0.53705 0.072467
C  4.495434 -1.381417 -0.199491
C  4.041458 1.424769 0.202593
C  5.576185 -0.479946 -0.067288
C  5.350024 0.909455 0.131811
H  -5.318704 1.412599 0.175224
H  -5.513172 -1.540256 1.086204
H  -6.805816 -0.313354 1.209723
H  -5.299536 -0.13171 2.16376
H  -5.278847 0.502074 -2.174161
H  -6.795229 0.064135 -1.325544
H  -5.5075 -1.154296 -1.545478
H  -3.186336 2.331601 0.319486
H  -3.53654 -1.950119 -0.312643
H  -0.682586 2.121037 0.297196
H  -1.066952 -2.156903 -0.334994
H  4.678606 -2.449183 -0.352545
H  3.848446 2.490628 0.355005
H  6.60172 -0.861091 -0.119408
H  6.205391 1.586121 0.231077
