program: Gaussian 09
title: 000233871
version: EM64L-G09RevD.01
frameworkgroup: C1[X(C15H12N2OS)]
method: RPBEPBE
basis: SDD
operation: Freq
keyword: #p
keyword: freq=noraman
keyword: PBEPBE/SDD
title: #p freq=noraman PBEPBE/SDD
converged: YES YES NO NO
title: Mulliken charges:
elementType: S O N N C C C C C C C C C C C C C C C H H H H H H H H H H H H
charge: 0.225120 -0.250783 -0.036144 -0.437653 0.558442 -0.382071 -0.338128 0.325929 -0.386675 -0.365933 0.489963 -0.447423 -0.357184 -0.278208 -0.350989 -0.239225 -0.213775 0.215101 -0.799129 0.276326 0.235665 0.221648 0.310304 0.246017 0.257543 0.230139 0.230890 0.312109 0.238156 0.271206 0.238761
chargesum: 0.00000
title: Mulliken charges with hydrogens summed into heavy atoms:
elementType: S O N N C C C C C C C C C C C C C C C
charge: 0.225120 -0.250783 -0.036144 -0.125544 0.558442 -0.382071 -0.338128 0.325929 -0.110350 -0.130268 0.489963 -0.225774 -0.046880 -0.032191 -0.093447 -0.009085 0.017116 0.215101 -0.051007
polarizability: 4.42412949e+02 -4.44484014e+00 1.89425952e+02 4.54952165e-02 7.45717507e-03 7.80061116e+01
1716.lowfreq: -74.5724 -9.0145 -1.1325 0.0013 0.0015 0.0019 1.6568 28.7821 37.1114
frequency: -74.5722 28.7200 37.0084 64.4719 73.5994 81.7139 152.1334 152.8623 189.1074 204.3268 265.1222 278.9898 349.6762 360.3514 371.8069 398.9055 406.6816 437.7104 486.7979 504.4205 525.7055 554.5115 582.2460 584.5085 615.2018 615.7434 649.2128 651.6675 676.3394 682.7177 733.4984 743.7372 766.3756 817.1609 837.0348 843.8306 861.5694 863.8364 905.1327 930.6692 946.4964 977.9535 983.9757 984.2236 991.2631 1007.2505 1015.4730 1031.0826 1042.8828 1116.7664 1125.1901 1168.7535 1185.6362 1200.8597 1219.2591 1254.1459 1265.3321 1294.0783 1310.9729 1362.6741 1375.4216 1376.7771 1423.0907 1431.6780 1443.9531 1447.8747 1467.6979 1486.3515 1490.0638 1538.6181 1565.0599 1583.1127 1605.7799 1622.0237 1638.4421 2987.3284 3072.2340 3112.6368 3134.1371 3135.8015 3136.9300 3150.0895 3164.4325 3169.1833 3174.9641 3199.5180 3518.3763
redmass: 1.0517 6.6320 4.3374 5.9569 5.0144 4.6539 4.9067 6.1476 5.7716 6.1341 5.3921 5.9061 5.3325 5.3036 4.8093 7.6867 2.9424 3.1717 8.9673 3.4066 5.1414 3.3407 2.9736 6.4246 5.1797 7.6822 8.0082 1.1819 6.4939 6.8213 2.5321 3.6742 1.5935 4.6448 1.3343 6.5359 1.5730 1.4148 8.0339 6.5771 1.3828 1.3638 1.7020 1.3185 1.3412 2.5926 2.2067 1.6632 5.0239 1.5781 1.3556 1.1635 1.3547 2.0964 3.2163 1.7596 1.8607 2.7762 1.4395 4.4250 4.3011 1.2715 3.7846 2.9653 2.5181 1.2107 1.0468 3.0515 2.2356 5.2531 6.1442 5.0777 7.2135 5.8608 5.3444 1.0385 1.0983 1.0902 1.0908 1.0856 1.0979 1.0903 1.0955 1.0945 1.0998 1.0944 1.0764
irintensity: 0.0207 0.7385 5.0838 2.2888 7.1986 0.0319 0.2429 3.7463 1.5937 0.5627 0.0925 4.8101 1.0576 1.3759 10.6596 0.6941 0.0043 4.9134 0.9476 22.0223 2.1562 10.7879 0.8418 3.3674 4.1428 16.6859 22.0284 63.2232 18.8812 3.3391 22.2174 2.5417 77.6391 2.9849 18.8923 3.1140 65.3523 12.2690 54.1053 18.3194 2.8669 0.0206 43.7924 0.0284 3.7451 1.7075 12.0698 8.2420 5.6020 15.0897 14.4650 0.2010 74.1654 5.4189 128.3017 5.8768 50.9939 18.3995 101.6845 168.6457 14.2801 71.5994 23.4545 37.3995 10.0759 75.5631 20.3522 135.2483 607.3862 37.6150 8.4214 52.7950 3.3685 150.0663 119.0119 8.4666 14.4973 27.7159 6.7475 2.0939 7.6228 9.4680 17.8576 3.2984 26.8171 5.0985 14.4808
temp: 298.150 k
press: 1.00000 atm
elementType: 16 8 7 7 6 6 6 6 6 6 6 6 6 6 6 6 6 6 6 1 1 1 1 1 1 1 1 1 1 1 1
symmnumber: 1
zpe: 611417.1 jmol-1
zpe.correction: 0.232876 hartree
zpe.thermalcorrener: 0.248379 hartree
zpe.thermalcorrenthalpy: 0.249323 hartree
zpe.thermalcorrgfe: 0.188427 hartree
zpe.sumelectzpe: -1160.306411 hartree
zpe.sumelectthermal: -1160.290908 hartree
zpe.sumelectthermalent: -1160.289964 hartree
zpe.sumelectthermalfe: -1160.350860 hartree
dipole: 1.3643 3.2523 -0.0007
dipole: 3.5268
quadrupole: -85.1252 -111.3269 -123.7356
quadrupole: 22.6336 0.0203 -0.0095
quadrupole: 21.6040 -4.5976 -17.0064 22.6336 0.0203 -0.0095
hfenergy: -1160.539287 hartree
pointgroup: C01 [X(C15H12N2O1S1)]
dipole: -0.5113388 1.2896607 0.024712 debye
polarizability: 442.4860681|-0.5380877|189.3147649|-1.1744645|1.9553628|78.0441791 unknown
InChI: InChI=1S/C15H12N2OS/c1-10(18)16-12-8-6-11(7-9-12)15-17-13-4-2-3-5-14(13)19-15/h2-9,16H,1H3
charge 0 multiplicity 1
31 atoms
S  1.954874 -1.765715 -0.035791
O  -5.421725 -1.546921 -0.005466
N  2.01108 0.935189 0.010555
N  -4.537873 0.629922 0.029985
C  -0.3058 0.060425 0.004155
C  1.151831 -0.069262 -0.003234
C  3.546493 -0.908814 -0.024297
C  3.349848 0.513782 -0.000132
C  -0.884395 1.362376 0.030035
C  -1.174616 -1.063341 -0.013484
C  -3.138612 0.388323 0.020411
C  -2.276299 1.522061 0.038105
C  -2.573135 -0.916187 -0.005725
C  4.836591 -1.472682 -0.037051
C  4.474153 1.374918 0.01149
C  5.94629 -0.597017 -0.025187
C  5.765276 0.812904 -0.001108
C  -5.591953 -0.294893 0.01725
C  -6.975243 0.355652 0.032586
H  -0.218431 2.23011 0.043655
H  -0.755921 -2.076477 -0.033538
H  -2.704051 2.532925 0.058308
H  -3.233323 -1.784428 -0.019393
H  4.98453 -2.55659 -0.055755
H  4.31642 2.457217 0.029979
H  6.958886 -1.014416 -0.034825
H  6.642243 1.468898 0.00764
H  -4.809672 1.616388 0.048569
H  -7.117879 0.978089 0.935522
H  -7.735412 -0.438257 0.027955
H  -7.12767 0.997421 -0.855113
