program: Gaussian 09
title: 000233870
version: EM64L-G09RevD.01
frameworkgroup: C1[X(C17H17NO2S)]
method: RPBEPBE
basis: SDD
operation: Freq
keyword: #p
keyword: freq=noraman
keyword: PBEPBE/SDD
title: #p freq=noraman PBEPBE/SDD
converged: YES YES NO NO
title: Mulliken charges:
elementType: S O O N C C C C C C C C C C C C C C C C C H H H H H H H H H H H H H H H H H
charge: 0.198183 -0.240488 -0.228578 -0.032878 0.586227 -0.385093 0.209799 -0.497978 0.192072 -0.448870 -0.334783 0.323373 -0.323675 -0.280137 -0.354087 -0.245031 -0.245590 -0.241320 -0.214473 -0.683821 -0.682477 0.254119 0.273875 0.250746 0.243955 0.257124 0.210322 0.210381 0.211052 0.210886 0.228636 0.229764 0.206157 0.233615 0.233643 0.206190 0.234619 0.234542
chargesum: 0.00000
title: Mulliken charges with hydrogens summed into heavy atoms:
elementType: S O O N C C C C C C C C C C C C C C C C C
charge: 0.198183 -0.240488 -0.228578 -0.032878 0.586227 -0.385093 0.209799 -0.243858 0.192072 -0.174995 -0.334783 0.323373 -0.072929 -0.036182 -0.096964 0.175673 0.176347 -0.012684 0.015291 -0.010406 -0.007126
polarizability: 4.39586722e+02 -5.40967250e+00 2.29976041e+02 -1.84838638e-01 -5.21221435e-02 9.99958171e+01
1716.lowfreq: -2.7201 -0.0022 -0.0015 -0.0007 3.0640 5.3339 23.5706 32.9369 59.2289
frequency: 23.5697 32.9075 59.2287 65.9203 68.8098 93.4457 107.3178 118.2208 136.9321 156.8826 186.6158 204.4514 206.0275 238.8568 242.5193 257.0273 288.9403 316.0048 330.2632 363.1030 376.4073 393.5783 437.0497 456.8138 486.1163 511.6669 525.8159 567.5839 583.6023 584.5848 625.0092 648.2407 654.7990 680.7435 732.7897 739.6876 752.7414 765.0060 788.7428 811.1421 825.6087 837.1685 857.1715 859.8194 862.9075 888.6788 901.1377 944.6392 954.9326 982.4899 983.3351 1016.3113 1030.9178 1033.5095 1042.7285 1112.4404 1116.5688 1117.1759 1128.3436 1134.2648 1135.0339 1168.0798 1178.4784 1209.8584 1241.0857 1260.9154 1263.0320 1264.4790 1282.8812 1301.3320 1363.8662 1364.3081 1374.6155 1386.6234 1399.0660 1400.8533 1417.7312 1432.6542 1443.8512 1459.8928 1460.4766 1474.0438 1476.4064 1485.4413 1487.7887 1500.5969 1534.1443 1565.4232 1576.8754 1600.6521 1610.0424 2952.5245 2957.9707 2998.1565 2998.7884 3011.4521 3017.9275 3095.8102 3096.0853 3108.1945 3109.2826 3134.6193 3149.0669 3154.0221 3157.2063 3163.3519 3174.3514 3177.6309
redmass: 5.9324 4.5089 4.8887 3.5269 4.1649 3.4357 1.6718 1.7676 5.4302 4.6037 5.7319 4.9347 6.2458 1.1855 1.2518 3.9411 5.9530 4.5952 4.6607 6.0172 3.8911 7.9107 3.1780 3.1073 9.1363 5.9462 5.0726 7.0160 5.9544 4.7624 7.0433 7.4451 4.7107 7.1909 2.5051 2.6315 4.3992 1.5925 5.5219 1.3667 1.1671 1.1770 5.1027 1.5923 1.4035 4.5484 3.6735 1.3830 1.3735 1.3167 3.6789 2.1845 2.7101 2.6295 4.9817 2.2930 1.8528 1.9196 2.0868 1.4320 1.4387 1.1487 1.7018 3.2871 2.4679 1.9931 1.1442 1.1405 1.5073 2.6367 1.6255 1.3082 4.2938 2.6824 1.3074 1.3265 4.9482 3.0262 2.6662 1.0398 1.0397 1.2215 1.0571 1.1918 1.0832 2.0713 6.5363 6.1975 7.8287 6.6858 6.6869 1.0552 1.0552 1.0361 1.0364 1.1076 1.1076 1.0989 1.0989 1.1014 1.1014 1.0855 1.0903 1.0902 1.0875 1.0956 1.0997 1.0963
irintensity: 0.0241 1.4475 0.1135 2.9541 0.0292 2.2981 6.4431 0.0002 0.9628 1.0090 1.3994 0.3686 0.5321 1.3257 0.0255 3.9606 0.3295 1.4093 0.1669 0.0061 2.1742 1.2838 6.9357 3.0797 2.1023 0.8370 0.3014 12.6418 47.8313 2.1055 26.9545 2.9262 7.9911 2.2003 24.7555 1.0906 17.0898 78.6525 11.4364 29.6922 19.8452 3.1969 19.5865 18.6708 3.9978 48.7085 22.3063 3.0399 1.8658 0.0553 50.1650 15.4793 102.3041 43.7883 7.7542 48.6478 20.2489 11.5934 213.7823 4.3563 5.3695 0.1588 56.6653 41.0696 300.4392 226.5138 0.0191 0.0035 40.7701 80.5574 20.3058 19.3176 6.8978 17.7198 18.2574 63.5942 11.5647 21.2789 8.9016 5.6673 18.4471 153.1835 27.5142 129.9134 3.8259 221.5279 27.7034 0.5047 33.3330 62.2174 71.3003 32.9045 40.0465 24.3377 33.7198 33.1770 34.7372 50.3539 2.6094 27.8581 36.7523 1.9648 10.1448 5.9848 10.9846 19.7696 26.9117 8.2671
temp: 298.150 k
press: 1.00000 atm
elementType: 16 8 8 7 6 6 6 6 6 6 6 6 6 6 6 6 6 6 6 6 6 1 1 1 1 1 1 1 1 1 1 1 1 1 1 1 1 1
symmnumber: 1
zpe: 782515.0 jmol-1
zpe.correction: 0.298044 hartree
zpe.thermalcorrener: 0.317801 hartree
zpe.thermalcorrenthalpy: 0.318745 hartree
zpe.thermalcorrgfe: 0.248378 hartree
zpe.sumelectzpe: -1259.753621 hartree
zpe.sumelectthermal: -1259.733865 hartree
zpe.sumelectthermalent: -1259.732921 hartree
zpe.sumelectthermalfe: -1259.803287 hartree
dipole: 1.4120 0.2765 0.0143
dipole: 1.4389
quadrupole: -109.6212 -110.6177 -136.2690
quadrupole: -8.5976 -0.0014 -0.0056
quadrupole: 9.2148 8.2183 -17.4330 -8.5976 -0.0014 -0.0056
hfenergy: -1260.0516656 hartree
pointgroup: C01 [X(C17H17N1O2S1)]
dipole: -0.5583636 0.0913117 -0.0193244 debye
polarizability: 438.6214742|11.7700279|230.1241018|11.8313667|7.6498511|100.8130036 unknown
InChI: InChI=1S/C17H17NO2S/c1-3-19-14-10-9-12(11-15(14)20-4-2)17-18-13-7-5-6-8-16(13)21-17/h5-11H,3-4H2,1-2H3
charge 0 multiplicity 1
38 atoms
S  2.044964 1.640595 0.007052
O  -3.383959 1.627792 -0.180517
O  -4.33001 -0.836728 -0.35033
N  2.226333 -1.052433 -0.139568
C  -0.130603 -0.284339 -0.171496
C  1.318411 -0.092853 -0.113459
C  -2.425927 0.610986 -0.20222
C  -1.035275 0.815929 -0.141969
C  -2.942697 -0.725767 -0.294283
C  -0.64951 -1.600164 -0.261643
C  3.674062 0.856459 0.012928
C  3.542587 -0.571423 -0.071956
C  -2.040001 -1.814923 -0.322045
C  4.936241 1.47546 0.087225
C  4.705249 -1.379972 -0.082168
C  -2.900529 3.021015 -0.090368
C  -4.90919 -2.194402 -0.448445
C  6.085257 0.651391 0.075808
C  5.969063 -0.76269 -0.008341
C  -4.139295 3.912273 -0.08716
C  -6.424118 -2.018864 -0.493374
H  -0.639741 1.833652 -0.072536
H  0.050055 -2.440214 -0.283776
H  -2.417263 -2.838836 -0.391422
H  5.034154 2.563344 0.152035
H  4.597171 -2.466611 -0.146987
H  -2.309597 3.147131 0.840427
H  -2.246009 3.24159 -0.958974
H  -4.530712 -2.688976 -1.366412
H  -4.596306 -2.791223 0.432744
H  7.076944 1.113012 0.132833
H  6.87458 -1.378778 -0.015575
H  -3.842179 4.974668 -0.019895
H  -4.723363 3.767566 -1.011657
H  -4.78708 3.672475 0.772892
H  -6.917851 -3.005116 -0.564777
H  -6.783145 -1.510725 0.417469
H  -6.719507 -1.4133 -1.366757
