program: Gaussian 09
title: 000233861
version: EM64L-G09RevD.01
frameworkgroup: C1[X(C17H20O4)]
method: RPBEPBE
basis: SDD
operation: Freq
keyword: #pfreq=noraman
keyword: PBEPBE/SDD
title: #p freq=noraman PBEPBE/SDD
converged: YES YES NO NO
title: Mulliken charges:
elementType: O O O O C C C C C C C C C C C C C C C C C H H H H H H H H H H H H H H H H H H H H
charge: -0.382596 -0.233186 -0.305182 -0.296730 -0.424651 -0.408032 -0.516202 -0.438218 0.284939 -0.363302 0.210994 -0.393250 0.497593 -0.035142 -0.559126 -0.329942 0.203752 0.183308 -0.365708 -0.529924 -0.530298 0.208009 0.205440 0.208528 0.204321 0.217791 0.246714 0.211400 0.216013 0.225688 0.239559 0.254522 0.248280 0.250567 0.376343 0.230137 0.224718 0.252319 0.255854 0.229993 0.224707
chargesum: 0.00000
title: Mulliken charges with hydrogens summed into heavy atoms:
elementType: O O O O C C C C C C C C C C C C C C C C C
charge: -0.006253 -0.233186 -0.305182 -0.296730 -0.011203 0.004816 -0.051696 -0.010804 0.284939 -0.137613 0.210994 -0.153691 0.497593 -0.035142 -0.304604 -0.081661 0.203752 0.183308 -0.115142 0.177250 0.180255
polarizability: 3.47882574e+02 6.55850703e+00 1.97423625e+02 -2.12556109e+00 -7.11277895e+00 1.26695364e+02
1716.lowfreq: -6.6527 -3.9400 -0.0008 -0.0007 -0.0006 9.1984 17.7588 21.6205 38.3788
frequency: 17.7179 21.3111 38.3597 48.3983 63.1653 80.9792 91.7650 106.4486 130.6712 140.2164 156.9617 160.2668 167.4867 181.8550 193.0870 228.7757 248.4246 257.1200 293.5477 308.2565 330.5896 351.8875 394.1325 415.2262 433.2885 443.9725 488.6081 503.3496 517.9503 557.3951 585.4375 595.4115 634.1866 650.4176 672.5950 709.4318 723.2404 741.7159 747.4736 773.3549 800.1174 832.4023 836.6154 845.4965 873.3995 888.4722 906.9999 917.7409 927.2585 937.5901 945.5764 959.7667 971.8812 980.4702 1045.5866 1076.5049 1078.1135 1090.0510 1104.8636 1112.6893 1115.8466 1132.8497 1149.9844 1156.2170 1163.4160 1172.6355 1184.9576 1211.6217 1238.4574 1248.8954 1260.1382 1268.9862 1283.0736 1310.5008 1333.9795 1336.3864 1339.7873 1346.1490 1361.6949 1376.1042 1401.8959 1424.5754 1442.0108 1451.5197 1457.2592 1458.0072 1459.7719 1467.8843 1473.0278 1477.1959 1486.2615 1488.0000 1560.8368 1601.4381 1607.2396 1636.6022 1650.2418 2944.3629 2963.5007 2971.2251 2975.1687 2978.5032 2979.2899 3005.5436 3036.3067 3039.1879 3048.8374 3067.2944 3072.8558 3098.0189 3103.2572 3120.6475 3123.5599 3143.3744 3149.6058 3170.9947 3484.1592
redmass: 6.1232 3.4628 4.4402 4.3965 4.6844 4.1269 3.7267 2.8369 3.5828 3.5328 2.8205 1.4406 1.1464 3.3269 2.9510 2.8321 4.3541 4.5081 2.6790 3.0733 4.5412 4.3122 4.7805 4.3204 3.2494 2.5762 3.5873 4.0841 2.8629 5.3406 3.8083 2.0819 3.4609 2.1827 4.0368 5.1742 4.5572 3.3671 3.3348 4.6468 1.3875 2.8926 1.5679 1.6738 2.2484 2.1034 2.0348 1.4196 2.8713 2.0323 7.9566 1.4027 2.8511 3.7988 2.8450 1.8562 1.7452 2.9193 1.4768 1.2388 1.2429 1.1799 1.3599 1.3517 1.4591 1.5191 2.5639 1.9298 1.2976 2.3056 1.4765 1.4858 2.2680 1.3290 1.4925 1.7154 2.5694 1.6711 1.6803 2.8587 2.4194 1.1748 1.3267 1.1035 1.0809 1.0535 1.0653 1.0851 1.0934 1.0601 2.6458 1.0879 6.6351 7.6016 6.5275 7.7155 7.5502 1.0657 1.0674 1.0307 1.0310 1.0652 1.0612 1.0904 1.0925 1.0994 1.1035 1.1043 1.1038 1.0884 1.0894 1.1026 1.1031 1.0916 1.0876 1.0966 1.0636
irintensity: 1.1089 0.4830 1.0303 0.7351 3.3455 0.4824 1.9221 7.9973 1.3948 1.6413 4.4217 0.0387 0.0698 1.2609 4.8125 4.1582 9.5641 2.1239 5.2096 3.9074 0.1436 0.8421 1.6598 3.8671 7.5200 5.0555 6.4612 2.5565 15.7854 11.1966 29.0427 94.8363 9.0096 102.4730 0.8982 2.6326 4.7857 5.8168 3.5034 19.1134 7.1778 3.8228 23.6739 7.1031 6.1469 16.1466 8.1410 7.8481 27.5143 6.0199 67.4357 10.3625 25.0749 66.7582 214.7936 2.9657 17.2067 52.2850 5.7224 23.6160 5.2203 10.4811 4.7943 4.7581 8.3861 2.8228 17.0310 51.7349 8.9876 155.8672 10.2421 12.3340 66.6237 10.4857 3.0659 4.8816 19.4749 5.8909 0.9500 6.9260 11.5696 1.6241 11.2017 0.7966 17.9032 15.9470 8.3089 11.8253 7.8567 8.4499 146.3136 63.5475 12.1909 65.4806 1.9606 111.9072 78.7911 37.4010 18.2029 78.1497 90.5449 34.1505 35.4142 54.1301 23.1504 68.4803 64.8519 28.4812 23.7240 17.4714 15.0381 25.5990 26.9915 4.5185 5.4393 6.0381 21.3999
temp: 298.150 k
press: 1.00000 atm
elementType: 8 8 8 8 6 6 6 6 6 6 6 6 6 6 6 6 6 6 6 6 6 1 1 1 1 1 1 1 1 1 1 1 1 1 1 1 1 1 1 1 1
symmnumber: 1
zpe: 869369.4 jmol-1
zpe.correction: 0.331125 hartree
zpe.thermalcorrener: 0.352473 hartree
zpe.thermalcorrenthalpy: 0.353417 hartree
zpe.thermalcorrgfe: 0.278578 hartree
zpe.sumelectzpe: -959.084616 hartree
zpe.sumelectthermal: -959.063268 hartree
zpe.sumelectthermalent: -959.062324 hartree
zpe.sumelectthermalfe: -959.137163 hartree
dipole: 0.6397 -1.5202 0.6743
dipole: 1.7818
quadrupole: -103.2423 -121.4093 -122.6565
quadrupole: 2.3658 -1.9707 1.6301
quadrupole: 12.5270 -5.6400 -6.8871 2.3658 -1.9707 1.6301
hfenergy: -959.4157416 hartree
pointgroup: C01 [X(C17H20O4)]
dipole: 0.2129576 0.5871358 0.3183376 debye
polarizability: 348.1465257|3.0116729|159.7803025|-0.6164353|35.855042|164.0747347 unknown
InChI: InChI=1S/C17H20O4/c1-20-15-9-8-12(11-16(15)21-2)10-14(17(18)19)13-6-4-3-5-7-13/h6,8-11,18H,3-5,7H2,1-2H3
charge 0 multiplicity 1
41 atoms
O  -1.163586 0.352337 -2.70651
O  -1.855871 -1.827767 -2.32843
O  3.906648 1.339728 1.568662
O  5.009195 -0.374569 -0.547469
C  -5.441875 -1.102198 0.47401
C  -5.956299 0.337837 0.68972
C  -4.179697 -1.113194 -0.417566
C  -4.884614 1.1913 1.407852
C  -3.146137 -0.079634 0.035828
C  -3.492237 0.964044 0.851365
C  -1.740343 -0.229568 -0.44836
C  -0.652352 0.021449 0.351879
C  0.788352 -0.091282 0.064978
C  -1.595054 -0.688696 -1.872539
C  1.688143 0.634208 0.896827
C  1.345628 -0.905032 -0.9654
C  3.080525 0.582077 0.702865
C  3.621393 -0.26104 -0.311788
C  2.738957 -0.986091 -1.14346
C  4.694005 2.396344 0.889934
C  5.796635 -0.913589 0.588066
H  -6.226765 -1.731023 0.012527
H  -5.202261 -1.553923 1.457627
H  -6.894809 0.335256 1.275782
H  -6.189101 0.791354 -0.294301
H  -4.467178 -0.911917 -1.470952
H  -3.722666 -2.119744 -0.425997
H  -4.883625 0.956948 2.494991
H  -5.138322 2.26792 1.336058
H  -2.729662 1.710815 1.113633
H  -0.886895 0.337833 1.37833
H  1.309499 1.278652 1.698324
H  0.698888 -1.524833 -1.592729
H  3.174418 -1.633057 -1.911694
H  -1.076817 0.00499 -3.637795
H  5.309568 2.855054 1.678612
H  4.014947 3.152843 0.453129
H  5.334053 1.966899 0.098042
H  5.649079 -0.305322 1.498097
H  6.846148 -0.873921 0.259294
H  5.502385 -1.961589 0.785658
