program: Gaussian 09
title: 000233860
version: EM64L-G09RevD.01
frameworkgroup: C1[X(C17H16ClNO)]
method: RPBEPBE
basis: SDD
operation: Freq
keyword: #p
keyword: freq=noraman
keyword: PBEPBE/SDD
title: #p freq=noraman PBEPBE/SDD
converged: NO YES NO NO
title: Mulliken charges:
elementType: Cl O N C C C C C C C C C C C C C C C C C H H H H H H H H H H H H H H H H
charge: -0.044795 -0.210064 -0.122592 -0.371877 -0.484512 -0.538358 0.273682 0.267072 -0.471539 -0.378755 -0.389313 0.084468 -0.247464 -0.244448 0.282806 -0.309697 -0.349411 -0.224789 -0.219930 -0.104578 0.217282 0.202603 0.245902 0.213184 0.229357 0.214767 0.229262 0.231707 0.234252 0.232193 0.228499 0.227667 0.296199 0.283176 0.257655 0.260389
chargesum: 0.00000
title: Mulliken charges with hydrogens summed into heavy atoms:
elementType: Cl O N C C C C C C C C C C C C C C C C C
charge: -0.044795 -0.210064 -0.122592 0.048008 -0.025426 -0.094234 0.273682 0.267072 -0.010569 -0.144502 -0.157120 0.084468 -0.018965 -0.016781 0.282806 -0.013498 -0.066235 0.032866 0.040459 -0.104578
polarizability: 2.28615853e+02 -6.70037092e+00 1.95662600e+02 -1.21624699e+01 -1.30470744e+01 1.71585858e+02
1716.lowfreq: -8.9001 -0.0006 0.0012 0.0016 0.9266 8.6695 16.3724 29.9897 37.0392
frequency: 16.2731 29.9481 36.7351 62.8025 82.7868 95.2922 134.1241 157.3941 211.6400 225.5315 249.1073 256.1857 297.5640 300.3498 335.8845 380.2333 390.3865 408.1186 428.7764 444.3272 451.7540 483.6095 501.3481 528.9906 570.4550 595.2138 622.2594 641.5915 670.2616 711.9884 726.8026 732.8477 748.0650 751.5282 803.8115 839.0449 844.9084 852.6816 868.9923 926.8272 940.7288 951.3570 979.7781 985.5971 989.1867 992.6937 1000.3696 1016.5414 1036.9902 1043.3613 1062.2122 1070.7126 1094.8384 1106.4503 1128.1196 1134.0443 1173.8620 1179.7085 1191.8824 1200.2947 1205.9478 1230.4377 1233.7526 1266.8999 1275.4530 1292.2278 1299.5571 1321.1169 1344.1227 1354.7391 1371.8875 1379.8190 1392.5713 1398.7032 1442.7759 1445.5713 1450.6432 1462.6706 1470.8264 1481.5409 1492.2913 1557.5471 1585.2015 1596.3758 1599.6260 1617.4457 2830.7805 2866.7092 2897.3828 2976.2934 3001.6499 3006.3033 3030.5509 3034.8548 3111.9558 3116.0381 3137.3124 3143.1572 3153.2791 3159.6314 3170.6573 3175.4808
redmass: 7.0466 4.0554 4.0454 4.7334 11.1694 5.6904 3.0930 4.2435 3.0006 4.3339 4.9767 2.7244 4.4266 7.7237 2.9515 4.7428 3.1300 2.9401 2.6027 4.1206 3.5374 4.1777 3.6432 5.0341 4.3852 4.9239 6.8778 3.8190 3.7432 3.4472 3.3515 4.3308 4.7661 1.3203 2.3529 1.4052 1.8926 2.0836 1.3574 2.4659 1.4024 2.3786 1.4427 1.3634 1.6931 1.4065 3.9931 2.2658 2.2934 3.2804 2.2605 2.5501 2.7114 1.3327 2.2716 2.0804 1.0579 1.1364 1.1551 1.7581 1.6123 1.4618 2.0624 1.4888 2.2535 1.2824 1.5265 1.3131 1.6169 1.5945 4.6218 2.0309 2.7662 3.9437 1.9788 1.2055 1.0977 1.1144 2.3828 1.1050 2.4351 8.4939 7.4069 6.7914 7.2130 6.4840 1.0711 1.0706 1.0660 1.0612 1.0915 1.0858 1.0905 1.0988 1.0866 1.0895 1.0928 1.0912 1.0888 1.1005 1.0953 1.0971
irintensity: 0.2864 0.2807 0.2526 1.6215 3.2389 0.0045 0.3606 1.3847 5.1977 0.9177 0.7279 8.4195 0.9407 1.0274 2.7415 3.2486 11.5133 1.5571 6.4441 5.2874 5.6157 17.9560 0.1777 23.7702 3.5568 2.0941 0.4663 2.5081 11.0920 0.1175 10.4082 3.4393 68.0995 67.8780 6.4096 13.6779 32.8573 32.7781 2.6704 24.5355 1.0018 15.0098 3.2514 0.0134 0.2366 2.0033 40.0781 8.8974 6.2952 1.7541 5.8889 47.5144 33.1025 5.2658 10.5039 11.1607 0.1829 35.1575 4.7399 1.4012 7.1926 42.4564 3.8031 2.8029 116.9646 4.0577 59.4123 13.8207 2.5078 2.9498 10.5371 3.4478 3.6315 19.3249 0.5159 16.6005 8.4103 4.0488 27.3261 14.7984 19.5618 133.7098 123.0210 8.3487 40.2947 0.7402 51.3111 94.6647 89.0776 24.0234 23.7640 24.4979 42.0067 44.3646 14.1569 2.0782 27.1183 14.9743 0.2667 32.4183 3.8309 6.5594
temp: 298.150 k
press: 1.00000 atm
elementType: 17 8 7 6 6 6 6 6 6 6 6 6 6 6 6 6 6 6 6 6 1 1 1 1 1 1 1 1 1 1 1 1 1 1 1 1
symmnumber: 1
zpe: 748126.3 jmol-1
zpe.correction: 0.284946 hartree
zpe.thermalcorrener: 0.302174 hartree
zpe.thermalcorrenthalpy: 0.303118 hartree
zpe.thermalcorrgfe: 0.237340 hartree
zpe.sumelectzpe: -1246.011153 hartree
zpe.sumelectthermal: -1245.993926 hartree
zpe.sumelectthermalent: -1245.992982 hartree
zpe.sumelectthermalfe: -1246.058760 hartree
dipole: -2.0740 -0.4687 2.0123
dipole: 2.9276
quadrupole: -124.2328 -132.1884 -116.2192
quadrupole: 3.1616 -4.2439 5.7627
quadrupole: -0.0193 -7.9749 7.9942 3.1616 -4.2439 5.7627
hfenergy: -1246.2960994 hartree
pointgroup: C01 [X(C17H16Cl1N1O1)]
dipole: 0.8101292 0.7871711 0.225113 debye
polarizability: 224.6169584|10.9366985|181.932259|16.5623693|-16.3811642|189.3150938 unknown
InChI: InChI=1S/C17H16ClNO/c18-16-7-5-14(6-8-16)17(20)12-19-10-9-13-3-1-2-4-15(13)11-19/h1-8H,9-12H2
charge 0 multiplicity 1
36 atoms
Cl -4.874116 1.310263 -3.101287
O  -1.909985 -2.027178 2.07235
N  0.612368 0.347992 1.333861
C  1.581192 1.255272 2.005419
C  1.299546 -0.813579 0.713904
C  2.493702 1.905412 0.951618
C  2.518763 -0.415212 -0.107745
C  3.109223 0.86942 0.020878
C  -0.466289 -0.091569 2.249714
C  3.092972 -1.361659 -0.992361
C  4.264563 1.178116 -0.740841
C  -1.591039 -0.905214 1.576265
C  4.240752 -1.046115 -1.748742
C  4.83153 0.233575 -1.621818
C  -2.344979 -0.34022 0.40993
C  -1.996037 0.892439 -0.207576
C  -3.472322 -1.064018 -0.070601
C  -2.763125 1.39797 -1.278282
C  -4.24595 -0.57099 -1.137266
C  -3.877688 0.659521 -1.722889
H  1.01253 2.032837 2.548218
H  2.198622 0.703992 2.758856
H  0.575577 -1.344906 0.067035
H  1.617156 -1.548001 1.500495
H  1.893243 2.622197 0.35696
H  3.288846 2.489263 1.453984
H  -0.086398 -0.729923 3.083264
H  -0.923715 0.814231 2.697145
H  2.633361 -2.353479 -1.090354
H  4.722051 2.170357 -0.638022
H  4.670563 -1.787865 -2.430881
H  5.724932 0.489081 -2.202435
H  -1.095805 1.415481 0.130322
H  -3.727354 -2.011526 0.415205
H  -2.49796 2.342107 -1.762324
H  -5.115529 -1.121671 -1.506699
