program: Gaussian 09
title: 000233843
version: EM64L-G09RevD.01
frameworkgroup: C1[X(C15H10Cl2O2)]
method: RPBEPBE
basis: SDD
operation: Freq
keyword: #p
keyword: freq=noraman
keyword: PBEPBE/SDD
title: #p freq=noraman PBEPBE/SDD
converged: YES YES NO NO
title: Mulliken charges:
elementType: Cl Cl O O C C C C C C C C C C C C C C C H H H H H H H H H H
charge: -0.051723 -0.066558 -0.418375 -0.222000 0.318057 0.200266 0.454080 -0.369851 -0.381526 -0.370306 -0.334641 -0.410038 -0.217996 -0.209569 -0.111244 -0.111542 -0.225625 0.047635 -0.243710 0.230378 0.255383 0.285559 0.315513 0.237366 0.257586 0.257798 0.237189 0.261197 0.386696
chargesum: 0.00000
title: Mulliken charges with hydrogens summed into heavy atoms:
elementType: Cl Cl O O C C C C C C C C C C C C C C C
charge: -0.051723 -0.066558 -0.031679 -0.222000 0.318057 0.200266 0.454080 -0.139473 -0.126143 -0.084747 -0.019129 -0.172672 0.039590 0.048229 -0.111244 -0.111542 0.011564 0.047635 0.017487
polarizability: 3.67947862e+02 -1.07505500e+01 1.74441871e+02 -2.40528388e+00 2.78419858e+00 1.03132422e+02
1716.lowfreq: -6.3226 -4.4218 -0.0015 0.0005 0.0006 0.9512 17.6435 19.7103 43.6290
frequency: 17.5882 19.5826 43.6190 56.3040 74.4367 100.7589 130.0847 163.7186 179.4318 186.8330 239.3015 256.1996 283.5374 310.5989 348.6747 360.2717 389.5047 408.1686 411.6158 441.5530 478.0643 521.4309 552.8976 574.9855 603.6796 623.3650 652.9057 672.7594 682.0393 690.8131 715.2369 733.0156 764.8932 791.4761 825.1017 840.7021 861.9372 891.9989 913.1038 931.6783 943.0806 956.6027 978.0249 980.9792 984.8405 998.4258 1061.8960 1077.4459 1081.4316 1094.3065 1117.4034 1182.0152 1196.0254 1203.3831 1243.4967 1278.2709 1299.4555 1300.6844 1347.0315 1370.6154 1391.9553 1400.2921 1431.5046 1462.9662 1476.6342 1562.7013 1569.3615 1589.2901 1602.7232 1604.6319 1645.6479 3090.6145 3130.5071 3143.8144 3154.6487 3157.6100 3172.1270 3176.7882 3177.4027 3195.9616 3484.8943
redmass: 10.9961 9.9563 4.9438 6.0337 7.8985 11.2677 7.8320 9.0241 7.0466 5.0160 8.7087 8.4853 4.8889 6.4068 5.5315 4.3526 10.7926 7.7883 2.9813 3.1574 4.0709 3.1444 4.3246 4.9790 3.1637 5.9264 1.9544 5.6719 5.3869 2.2882 3.9553 5.3518 3.9861 1.6024 1.4239 1.3923 5.4387 1.4038 1.3910 1.7234 3.1610 1.4645 1.3480 1.3742 5.4303 4.2052 3.0756 2.4840 2.0894 1.6357 1.3767 1.1618 1.1391 2.0635 2.6405 2.0007 1.3781 1.2743 3.4028 5.4455 3.4101 3.0103 2.2655 2.3065 2.3799 6.3523 7.0923 6.1076 6.5478 7.1168 8.9599 1.0870 1.0883 1.0889 1.0927 1.0889 1.0959 1.0973 1.0979 1.0924 1.0636
irintensity: 0.3119 1.1609 0.1658 0.4649 2.0525 0.5764 0.3160 0.7155 0.2742 0.1247 2.8778 1.6708 1.4633 3.0321 0.9978 0.9511 7.8422 14.4285 1.0163 4.9761 11.5296 40.1372 5.7599 15.4748 70.8041 6.8826 72.5909 8.1725 2.7727 26.3884 22.2420 48.6334 9.5393 36.2971 38.5393 45.6268 9.9974 2.8742 6.6778 57.6792 72.5555 21.3915 0.0431 0.6551 1.9833 36.4069 144.4958 49.4898 56.1030 1.6463 9.0536 2.9226 2.8070 15.1905 30.4460 11.8007 2.7482 4.2540 16.1980 9.7934 11.7982 13.7608 25.0052 3.9899 119.8379 54.5216 0.7660 36.4929 20.5761 29.3321 188.0423 21.2077 7.3516 4.5136 13.0095 0.7380 3.4027 3.7694 6.2958 16.8199 32.2586
temp: 298.150 k
press: 1.00000 atm
elementType: 17 17 8 8 6 6 6 6 6 6 6 6 6 6 6 6 6 6 6 1 1 1 1 1 1 1 1 1 1
symmnumber: 1
zpe: 538686.6 jmol-1
zpe.correction: 0.205175 hartree
zpe.thermalcorrener: 0.222097 hartree
zpe.thermalcorrenthalpy: 0.223041 hartree
zpe.thermalcorrgfe: 0.157158 hartree
zpe.sumelectzpe: -1646.838768 hartree
zpe.sumelectthermal: -1646.821847 hartree
zpe.sumelectthermalent: -1646.820902 hartree
zpe.sumelectthermalfe: -1646.886786 hartree
dipole: 1.1470 -1.8495 -0.3878
dipole: 2.2106
quadrupole: -135.8326 -109.8920 -128.0935
quadrupole: -6.9106 2.7828 -2.9565
quadrupole: -11.2265 14.7140 -3.4875 -6.9106 2.7828 -2.9565
hfenergy: -1647.0439431 hartree
pointgroup: C01 [X(C15H10Cl2O2)]
dipole: 0.5168562 -0.4737666 0.514612 debye
polarizability: 368.2297452|0.5174008|122.9297466|-8.3472589|-31.9180697|154.3626629 unknown
InChI: InChI=1S/C15H10Cl2O2/c16-12-6-4-11(5-7-12)14(15(18)19)9-10-2-1-3-13(17)8-10/h1-9,18H
charge 0 multiplicity 1
29 atoms
Cl -6.39513 -0.711816 0.724296
Cl 5.29579 0.210088 -1.807794
O  0.584504 0.532087 -2.518828
O  -0.432849 2.388866 -1.586676
C  -1.882739 0.068997 -0.088059
C  -0.42138 0.288295 -0.322826
C  1.980037 -0.20315 0.598015
C  0.506482 -0.239059 0.547424
C  -2.332369 -1.192572 0.39825
C  -2.853713 1.079923 -0.338137
C  2.832105 -0.024033 -0.531423
C  2.585506 -0.396872 1.876468
C  -3.6977 -1.435251 0.652898
C  -4.222939 0.848447 -0.089442
C  -4.62656 -0.405611 0.407126
C  4.222702 -0.010915 -0.345023
C  3.985035 -0.37415 2.033476
C  -0.095164 1.187483 -1.481333
C  4.828896 -0.175611 0.915898
H  0.065353 -0.722772 1.431688
H  -1.614438 -2.00669 0.543857
H  -2.534507 2.060569 -0.702734
H  2.407598 0.058866 -1.53257
H  1.944738 -0.55087 2.752618
H  -4.032941 -2.410655 1.016601
H  -4.960051 1.635338 -0.272981
H  4.428832 -0.51424 3.024469
H  5.917272 -0.160753 1.020409
H  0.723027 1.173758 -3.27047
