program: Gaussian 09
title: 000233840
version: EM64L-G09RevD.01
frameworkgroup: C1[X(C14H11ClO)]
method: RPBEPBE
basis: SDD
operation: Freq
keyword: #p
keyword: freq=noraman
keyword: PBEPBE/SDD
title: #p freq=noraman PBEPBE/SDD
converged: YES YES NO NO
title: Mulliken charges:
elementType: Cl O C C C C C C C C C C C C C C H H H H H H H H H H H
charge: -0.040969 -0.217879 -0.674937 0.497011 0.124906 0.321442 -0.381859 -0.440528 -0.343608 -0.333202 -0.216843 -0.224741 -0.219082 -0.221558 -0.245022 -0.103087 0.262529 0.224584 0.256518 0.231390 0.284083 0.252929 0.228644 0.228086 0.261120 0.259039 0.231034
chargesum: 0.00000
title: Mulliken charges with hydrogens summed into heavy atoms:
elementType: Cl O C C C C C C C C C C C C C C
charge: -0.040969 -0.217879 -0.187825 0.497011 0.124906 0.321442 -0.125340 -0.209138 -0.059525 -0.080273 0.011801 0.003345 0.042038 0.037481 -0.013987 -0.103087
polarizability: 1.97420192e+02 4.32275809e+00 1.62825547e+02 -1.27705285e+00 1.54594343e+01 1.16632121e+02
1716.lowfreq: -11.2166 -7.1607 -0.0031 -0.0023 -0.0019 2.1173 18.6092 30.7746 47.3524
frequency: 18.2876 30.7525 47.3447 82.8662 96.4134 144.7754 202.1134 249.1656 295.2527 297.9842 316.3217 404.1939 405.6336 429.5866 451.9220 468.2772 514.5597 528.3206 602.2253 619.3545 623.0671 680.6647 706.9128 727.6723 736.6061 770.4356 806.8340 832.1387 856.2587 858.2213 917.9254 935.7687 956.1417 979.6247 989.1764 992.6429 996.8559 998.9830 1026.8697 1033.8956 1072.0097 1081.8292 1110.1588 1151.3925 1173.1243 1183.2132 1190.1649 1199.1306 1269.6525 1282.2216 1293.9894 1330.8803 1371.3126 1380.9106 1397.5120 1440.3096 1458.2157 1474.8916 1482.4895 1558.0368 1587.3320 1592.7915 1599.7782 1612.7963 3005.6498 3065.9208 3109.8255 3124.1611 3135.2401 3146.3510 3154.2365 3157.8819 3164.3079 3173.4799 3178.3424
redmass: 5.6424 4.2477 4.1081 11.0591 6.2392 6.0098 5.7190 6.9779 5.5245 8.3185 3.3151 2.8262 2.8678 3.5727 4.0370 3.0478 7.2745 3.8158 4.8058 5.8653 6.6445 4.4524 1.9343 4.3769 2.2006 2.8506 2.0125 1.4772 1.2549 1.8175 1.5222 2.1396 1.3996 1.3872 5.8518 1.3790 2.5458 1.6845 2.2509 3.0712 2.7415 1.6111 1.3449 1.2879 1.0561 1.1341 1.1352 2.6625 1.9906 1.9245 1.2583 1.2917 5.2188 8.2548 4.2431 2.1451 1.1918 2.2057 2.1199 8.6152 7.2115 6.0703 6.8739 6.2963 1.0587 1.1024 1.0883 1.0863 1.0910 1.0959 1.0886 1.0881 1.1014 1.0967 1.0975
irintensity: 0.3354 0.0311 0.0868 3.1630 1.1474 1.4404 3.7667 0.4741 0.6756 0.2370 8.3919 0.0632 0.3355 8.3089 3.3834 11.4928 24.6049 22.3771 7.8260 5.0389 0.2816 6.9181 44.0436 3.7679 93.8662 4.0498 40.7392 0.5397 1.1933 29.0872 4.4845 15.0770 0.3705 0.2870 4.7013 2.2203 29.6763 15.0094 7.6303 13.8947 59.9233 9.6603 10.0170 40.1426 0.7066 13.7269 0.7624 1.7165 121.0756 99.2685 1.9343 8.9058 13.2765 0.6383 17.4452 7.5951 29.7584 14.9723 19.3344 134.0910 93.1490 20.6901 55.9932 5.7874 15.1278 10.1765 12.3410 0.7337 9.7127 30.4227 0.2454 2.6762 23.1662 5.5287 1.9775
temp: 298.150 k
press: 1.00000 atm
elementType: 17 8 6 6 6 6 6 6 6 6 6 6 6 6 6 6 1 1 1 1 1 1 1 1 1 1 1
symmnumber: 1
zpe: 540362.7 jmol-1
zpe.correction: 0.205813 hartree
zpe.thermalcorrener: 0.219465 hartree
zpe.thermalcorrenthalpy: 0.220409 hartree
zpe.thermalcorrgfe: 0.162531 hartree
zpe.sumelectzpe: -1074.261788 hartree
zpe.sumelectthermal: -1074.248136 hartree
zpe.sumelectthermalent: -1074.247192 hartree
zpe.sumelectthermalfe: -1074.305070 hartree
dipole: 0.8940 -2.1053 -1.0896
dipole: 2.5336
quadrupole: -101.8591 -103.8986 -93.7487
quadrupole: -8.7547 -0.1315 2.4642
quadrupole: -2.0236 -4.0632 6.0868 -8.7547 -0.1315 2.4642
hfenergy: -1074.4676008 hartree
pointgroup: C01 [X(C14H11Cl1O1)]
dipole: -0.4744868 -0.1975789 0.8540426 debye
polarizability: 195.6168358|-7.1440347|122.5647369|5.2885534|-22.1131198|158.6962871 unknown
InChI: InChI=1S/C14H11ClO/c15-13-8-6-12(7-9-13)14(16)10-11-4-2-1-3-5-11/h1-9H,10H2
charge 0 multiplicity 1
27 atoms
Cl 4.772266 -1.468549 1.430967
O  0.140386 1.848315 -2.343111
C  -1.196121 1.878131 -0.31634
C  -2.119279 0.674854 -0.102136
C  0.064496 1.523191 -1.120592
C  1.189429 0.781611 -0.457719
C  -2.50365 -0.136183 -1.201342
C  -2.625397 0.365952 1.185305
C  2.3606 0.517287 -1.220259
C  1.133019 0.341001 0.891727
C  -3.373196 -1.232886 -1.01376
C  -3.498919 -0.729381 1.374088
C  3.454766 -0.164038 -0.655814
C  2.219747 -0.345845 1.472137
C  -3.873592 -1.534777 0.27451
C  3.365573 -0.585625 0.687964
H  -1.721948 2.65355 -0.902298
H  -0.923016 2.319984 0.659541
H  -2.122337 0.096284 -2.202818
H  -2.347832 0.992591 2.043006
H  2.389306 0.859801 -2.259716
H  0.23702 0.512151 1.495013
H  -3.661473 -1.850786 -1.871654
H  -3.886119 -0.951793 2.374857
H  4.357004 -0.365068 -1.240356
H  2.177476 -0.690901 2.508964
H  -4.548611 -2.385573 0.418836
