program: Gaussian 09
title: 000233841
version: EM64L-G09RevD.01
frameworkgroup: C1[X(C14H12ClNO3)]
method: RPBEPBE
basis: SDD
operation: Freq
keyword: #p
keyword: freq=noraman
keyword: PBEPBE/SDD
title: #p freq=noraman PBEPBE/SDD
converged: YES YES NO NO
title: Mulliken charges:
elementType: Cl O O O N C C C C C C C C C C C C C C H H H H H H H H H H H H
charge: -0.040472 -0.251524 -0.190288 -0.139166 -0.063959 -0.440932 0.160895 0.219889 0.163161 -0.431178 0.386887 -0.772261 0.391149 -0.773621 -0.319293 -0.366043 -0.214913 -0.212882 -0.241303 0.338267 0.269142 0.250570 0.250351 0.284287 0.251625 0.252770 0.264021 0.255392 0.253654 0.232246 0.233530
chargesum: 0.00000
title: Mulliken charges with hydrogens summed into heavy atoms:
elementType: Cl O O O N C C C C C C C C C C C C C C
charge: -0.040472 -0.251524 -0.190288 -0.139166 -0.063959 -0.102666 0.160895 0.219889 0.163161 -0.162036 0.386887 0.012946 0.391149 -0.005204 -0.319293 -0.110650 0.038741 0.019364 -0.007773
polarizability: 2.59276776e+02 -1.10222440e+01 1.82836312e+02 4.51420858e+00 3.36471968e+00 9.69074773e+01
1716.lowfreq: -138.3771 -9.8404 0.0013 0.0019 0.0022 3.8604 4.8444 20.4315 33.2050
frequency: -138.3757 20.1968 33.1034 36.8920 70.0151 77.9174 122.7482 130.0714 144.6437 148.5902 164.8519 182.2911 213.1606 265.5720 276.9185 283.9180 342.4850 366.8746 435.5396 444.6026 447.2578 479.1161 490.4736 532.5276 546.5131 550.0542 577.0680 587.6957 609.7966 616.9014 662.4866 669.7533 723.6329 758.0774 780.4958 816.9569 853.2953 855.2155 862.6247 910.3507 936.4601 937.3504 975.3503 989.8039 1008.2852 1018.4957 1028.8489 1039.1662 1042.9718 1046.6018 1121.2539 1147.9350 1167.1985 1170.7574 1203.5664 1224.1213 1249.7214 1254.0240 1286.8511 1304.9325 1361.8245 1378.2791 1397.4742 1422.6585 1449.6650 1456.3580 1460.4401 1462.4877 1464.7582 1563.9510 1597.2631 1598.5476 1628.1881 1669.3680 1705.8894 2944.6218 2989.1999 2999.8297 3077.4694 3082.7620 3110.3546 3125.3354 3137.1980 3150.9416 3162.6283 3175.2154 3179.9627
redmass: 1.0332 8.4683 5.7523 5.5716 4.7606 5.2908 2.6158 3.0900 4.0584 4.1296 2.4125 5.2312 4.6300 9.2397 4.1152 3.2598 6.5259 10.6105 3.4814 6.4194 6.1020 6.5062 4.3559 4.8293 4.6757 4.7827 6.5746 3.9415 4.6546 5.2409 6.4108 4.2654 2.9247 1.4441 5.1916 2.6969 1.6110 2.1373 2.3715 5.5799 1.3758 3.9259 1.3167 3.0605 1.4838 6.1053 2.1903 1.5235 1.9382 1.7913 1.6272 2.6201 1.2548 1.4432 1.5409 2.5116 2.3383 1.6469 3.4336 2.7546 7.1211 1.2320 1.2159 2.3538 1.6562 1.3787 1.0751 1.0449 1.0656 6.3663 7.0132 10.4380 7.7829 9.6410 12.3962 1.0786 1.0363 1.0377 1.0972 1.0977 1.1001 1.0992 1.0855 1.0899 1.0952 1.1008 1.0931
irintensity: 0.1245 0.8795 1.6184 2.5628 2.7262 0.5291 0.5685 2.7145 1.2462 1.9144 0.6311 1.6530 14.9156 0.2925 1.6462 0.7940 1.1007 4.5663 12.6260 10.2739 1.6239 5.0575 12.5707 1.2105 1.3681 3.0153 6.4036 3.1309 8.5274 0.0682 21.5768 14.5818 16.8532 86.7659 9.6552 1.9655 32.2419 69.3910 75.7528 79.4797 2.1214 16.3381 0.2731 88.6185 6.8264 43.0645 6.4974 8.6474 1.1881 2.7980 7.6881 34.7826 0.3579 1.3418 38.3574 136.6572 7.2755 44.7431 73.6359 222.6793 6.3127 64.7787 37.0093 8.0856 15.1574 68.5207 14.7325 19.6948 18.3449 0.8481 12.5143 116.6694 317.4805 168.1624 224.9201 27.9742 3.2028 2.0992 5.7464 5.9409 8.3427 4.3508 2.1280 7.5559 10.5210 18.1026 1.9449
temp: 298.150 k
press: 1.00000 atm
elementType: 17 8 8 8 7 6 6 6 6 6 6 6 6 6 6 6 6 6 6 1 1 1 1 1 1 1 1 1 1 1 1
symmnumber: 1
zpe: 592133.9 jmol-1
zpe.correction: 0.225532 hartree
zpe.thermalcorrener: 0.243023 hartree
zpe.thermalcorrenthalpy: 0.243967 hartree
zpe.thermalcorrgfe: 0.177986 hartree
zpe.sumelectzpe: -1279.788959 hartree
zpe.sumelectthermal: -1279.771468 hartree
zpe.sumelectthermalent: -1279.770524 hartree
zpe.sumelectthermalfe: -1279.836505 hartree
dipole: -3.0889 -0.6479 -0.0954
dipole: 3.1575
quadrupole: -78.6475 -128.5700 -117.7748
quadrupole: -9.9903 7.0349 2.1284
quadrupole: 29.6833 -20.2392 -9.4440 -9.9903 7.0349 2.1284
hfenergy: -1280.0144911 hartree
pointgroup: C01 [X(C14H12Cl1N1O3)]
dipole: -1.2083705 0.2861638 0.0343206 debye
polarizability: 259.8513587|9.0332088|182.1815406|-3.2545066|4.8564566|96.9876664 unknown
InChI: InChI=1S/C14H12ClNO3/c1-8-7-12(17)13(14(18)19-8)9(2)16-11-6-4-3-5-10(11)15/h3-7,13H,1-2H3
charge 0 multiplicity 1
31 atoms
Cl 2.364617 -2.454934 -0.04715
O  -3.615042 1.208248 -0.01853
O  -1.55607 -2.374287 -0.437372
O  -1.757931 2.285268 -0.832556
N  0.934105 0.274773 0.522157
C  -1.411307 0.023343 0.116688
C  0.030487 0.055297 -0.390574
C  -2.173898 -1.311918 -0.151439
C  -2.195918 1.253253 -0.316793
C  -3.620436 -1.230115 0.042777
C  -4.277571 -0.028784 0.136896
C  0.258389 -0.163398 -1.867926
C  2.329695 0.339913 0.264835
C  -5.75349 0.166137 0.350891
C  3.141301 -0.805992 0.048415
C  2.983117 1.601662 0.35009
C  4.539867 -0.714601 -0.085146
C  4.37986 1.707732 0.199495
C  5.165397 0.550265 -0.015378
H  -1.349102 0.087178 1.227334
H  -4.188086 -2.16312 0.079094
H  1.297283 0.064477 -2.153682
H  -0.425016 0.465464 -2.466328
H  0.050832 -1.222935 -2.106792
H  -6.07032 -0.27441 1.312782
H  -6.334663 -0.327681 -0.448014
H  -5.998964 1.239052 0.353207
H  2.367265 2.486842 0.538435
H  5.126824 -1.623912 -0.24549
H  4.855352 2.692496 0.258089
H  6.252328 0.624788 -0.121813
