program: Gaussian 09
title: 000233818
version: EM64L-G09RevD.01
frameworkgroup: C1[X(C11H19NO2)]
method: RPBEPBE
basis: SDD
operation: Freq
keyword: #p
keyword: freq=noraman
keyword: PBEPBE/SDD
title: #p freq=noraman PBEPBE/SDD
converged: YES YES NO NO
title: Mulliken charges:
elementType: O O N C C C C C C C C C C C H H H H H H H H H H H H H H H H H H H
charge: -0.432004 -0.228423 -0.641461 0.286551 0.379270 -0.214581 0.223482 -0.591346 -0.564064 -0.481205 -0.854941 -0.797756 -0.801144 0.057824 0.243956 0.237801 0.248947 0.234254 0.238109 0.228016 0.225340 0.244942 0.215135 0.235070 0.234468 0.215253 0.212447 0.289425 0.204591 0.201931 0.298240 0.275090 0.376786
chargesum: 0.00000
title: Mulliken charges with hydrogens summed into heavy atoms:
elementType: O O N C C C C C C C C C C C
charge: -0.055219 -0.228423 -0.068132 0.286551 0.379270 0.029376 0.223482 -0.104598 -0.091701 -0.027849 -0.159795 -0.135588 -0.105197 0.057824
polarizability: 1.34089241e+02 3.01410164e+00 1.22800436e+02 2.34339650e+00 -1.55072609e+00 1.16181495e+02
1716.lowfreq: -23.7756 -4.9207 -0.0003 -0.0002 0.0003 19.1414 57.9322 88.2035 149.2876
frequency: 57.9229 88.0548 149.2784 164.0500 189.1707 203.5854 219.9194 237.2409 260.2165 273.6804 279.4899 303.2117 323.3563 348.9428 365.8497 393.9920 409.5012 428.4700 458.9241 493.4651 540.8210 567.2131 583.0926 601.1239 625.7208 670.3625 690.7612 714.1953 746.3267 806.7672 841.6858 858.4571 879.5346 910.3602 937.5662 944.5143 948.3503 959.6796 970.4088 994.9978 1009.6955 1031.8239 1059.9553 1082.3804 1104.3776 1125.4053 1153.2679 1165.1430 1177.3311 1195.1458 1196.1213 1214.8463 1234.0986 1240.9599 1263.0739 1270.3611 1275.7096 1295.3699 1306.0793 1312.7253 1377.3993 1386.4090 1396.9930 1454.7868 1459.6744 1469.3437 1471.3272 1482.9038 1487.9634 1493.1823 1506.6812 1510.8639 1635.3163 1636.8197 2969.1663 2976.6385 2978.8199 3004.3591 3014.1635 3016.2395 3046.7148 3049.1442 3051.4123 3057.0483 3066.5539 3073.8688 3075.7256 3083.8560 3092.8178 3109.8273 3434.4191 3510.6373 3563.7890
redmass: 10.6532 3.0998 2.7609 1.2704 1.9868 1.1741 1.3003 2.7914 2.4442 2.6106 2.6533 1.2635 2.6219 2.9637 2.6544 2.5805 2.6218 2.7173 2.3165 2.6935 3.6348 2.8288 1.5512 3.5264 3.1205 2.4136 1.6005 4.3999 2.9933 1.4374 2.5395 2.6660 2.1942 2.2499 2.2053 1.7835 1.4971 1.8249 2.1064 1.4469 2.1148 1.7469 1.8798 1.2584 1.5012 2.6241 2.4122 1.8515 2.2206 1.7441 2.1096 2.0227 1.4794 2.0255 1.8940 2.0210 2.0193 1.5473 1.7611 1.9101 1.2001 1.2293 1.1982 1.0614 1.0648 1.0604 1.0603 1.0581 1.0575 1.0623 1.0810 1.0559 1.5314 2.6562 1.0387 1.0368 1.0368 1.0595 1.0625 1.0623 1.0978 1.0966 1.0956 1.0972 1.0982 1.1039 1.0990 1.1028 1.0958 1.0965 1.0447 1.0640 1.0969
irintensity: 0.9568 0.2209 0.2563 0.2550 1.6382 1.7104 0.4560 3.3340 0.0990 1.8725 1.8180 32.1071 5.5376 2.0516 4.9741 0.5684 2.3200 9.0944 1.7578 7.9821 4.8550 19.2123 91.4918 14.6128 22.4648 87.1157 104.9178 10.9356 9.5961 9.4227 0.6364 3.6004 12.8686 4.7268 25.4514 5.6821 4.1443 4.2999 13.6967 10.2138 121.3839 33.2808 73.3526 6.6752 8.8283 15.7292 2.3264 5.5254 0.5483 3.4056 2.7589 4.8560 0.8280 1.4936 0.7401 0.9815 9.8427 0.8884 7.2551 3.4302 12.3170 16.6673 38.7140 7.4809 0.4194 7.7318 17.1356 8.7341 7.9182 6.6355 20.6579 6.7240 90.8096 154.6267 39.1436 22.8262 59.0814 31.2871 5.1369 65.7205 6.7517 33.6634 12.6632 70.9752 17.0737 53.6395 19.7911 15.9719 36.9989 3.1619 2.0237 22.5200 4.1600
temp: 298.150 k
press: 1.00000 atm
elementType: 8 8 7 6 6 6 6 6 6 6 6 6 6 6 1 1 1 1 1 1 1 1 1 1 1 1 1 1 1 1 1 1 1
symmnumber: 1
zpe: 748258.2 jmol-1
zpe.correction: 0.284996 hartree
zpe.thermalcorrener: 0.299433 hartree
zpe.thermalcorrenthalpy: 0.300377 hartree
zpe.thermalcorrgfe: 0.245965 hartree
zpe.sumelectzpe: -634.654799 hartree
zpe.sumelectthermal: -634.640363 hartree
zpe.sumelectthermalent: -634.639418 hartree
zpe.sumelectthermalfe: -634.693830 hartree
dipole: 0.3247 -1.1114 0.4600
dipole: 1.2459
quadrupole: -82.5222 -89.3334 -83.3407
quadrupole: -7.4707 1.9934 1.6878
quadrupole: 2.5432 -4.2680 1.7248 -7.4707 1.9934 1.6878
hfenergy: -634.9397958 hartree
pointgroup: C01 [X(C11H19N1O2)]
dipole: 0.1332726 -0.4410988 0.1671322 debye
polarizability: 133.8036932|3.2004013|123.0509387|2.9698593|-1.1406729|116.21654 unknown
InChI: InChI=1S/C11H19NO2/c1-9(2)7-4-5-10(9,3)11(12,6-7)8(13)14/h7,13H,4-6,12H2,1-3H3
charge 0 multiplicity 1
33 atoms
O  2.708115 -0.658027 0.975787
O  2.688173 1.309056 -0.242124
N  1.072794 -1.629922 -1.112983
C  -0.349003 -0.400658 0.652056
C  -1.692211 -0.172968 -0.176878
C  -1.162308 1.146904 -0.838083
C  0.7754 -0.317786 -0.484029
C  0.148884 0.676972 -1.523909
C  -0.255443 0.955319 1.428822
C  -0.756623 2.021743 0.389601
C  -0.289866 -1.650854 1.533146
C  -2.945697 0.042239 0.710536
C  -2.048902 -1.298976 -1.180379
C  2.107011 0.244623 0.067692
H  -1.865576 1.640898 -1.530399
H  -0.064091 0.140912 -2.465445
H  0.829566 1.515901 -1.743444
H  0.764308 1.16665 1.796579
H  -0.903579 0.916896 2.322401
H  -1.612045 2.600345 0.780484
H  0.036128 2.742342 0.121621
H  0.668094 -1.714537 2.079777
H  -1.104295 -1.632952 2.281198
H  -0.406593 -2.569551 0.930188
H  -2.865768 0.892111 1.408253
H  -3.825652 0.224604 0.06443
H  -3.161315 -0.865555 1.305348
H  -1.167704 -1.683288 -1.714271
H  -2.502528 -2.155036 -0.644651
H  -2.797721 -0.933014 -1.909824
H  1.558285 -2.278802 -0.483212
H  1.556826 -1.537802 -2.014343
H  3.580939 -0.278884 1.268055
