program: Gaussian 09
title: 000233881
version: EM64L-G09RevD.01
frameworkgroup: C1[X(C27H26Si)]
method: RPBEPBE
basis: SDD
operation: Freq
keyword: #p
keyword: freq=noraman
keyword: PBEPBE/SDD
title: #p freq=noraman PBEPBE/SDD
converged: YES YES NO NO
title: Mulliken charges:
elementType: Si C C C C C C C C C C C C C C C C C C C C C C C C C C C H H H H H H H H H H H H H H H H H H H H H H H H H H
charge: 1.234221 -0.965447 -0.929763 -0.943734 -0.130201 0.520999 0.515368 0.524398 -0.316718 -0.334983 -0.397213 -0.403305 -0.368877 -0.416331 -0.387467 -0.455847 -0.243320 -0.254149 -0.236429 -0.238197 -0.233945 -0.239614 -0.233438 -0.236706 -0.234450 -0.250936 -0.249936 -0.250855 0.264721 0.239487 0.264937 0.234074 0.241975 0.266212 0.236639 0.249492 0.228154 0.242683 0.253486 0.252926 0.225080 0.239930 0.226514 0.231197 0.229166 0.225324 0.224921 0.224428 0.225300 0.224279 0.225012 0.227552 0.227058 0.226328
chargesum: 0.00000
title: Mulliken charges with hydrogens summed into heavy atoms:
elementType: Si C C C C C C C C C C C C C C C C C C C C C C C C C C C
charge: 1.234221 -0.461239 -0.430752 -0.435547 -0.130201 0.520999 0.515368 0.524398 -0.080080 -0.085491 -0.169059 -0.160622 -0.115391 -0.163406 -0.162387 -0.215918 -0.016805 -0.022952 -0.007262 -0.012873 -0.009024 -0.015186 -0.008138 -0.012428 -0.009438 -0.023384 -0.022878 -0.024526
polarizability: 3.60338435e+02 1.78247497e+01 3.06219642e+02 2.00347492e+01 2.04600592e+01 2.49062126e+02
1716.lowfreq: -5.7157 -0.0009 -0.0008 -0.0001 1.0793 2.5914 13.3778 14.7700 19.7566
frequency: 12.6121 14.2609 19.6199 26.2287 37.7664 44.5492 47.1329 60.3167 67.2697 73.0595 90.8940 98.8900 134.7445 144.9260 150.9997 202.0246 203.9290 218.0776 273.5002 316.8270 326.7195 337.1139 339.3925 387.0966 392.6418 404.4801 404.5312 409.0709 462.7382 467.1875 481.8303 485.0185 548.2515 558.2854 572.8160 606.3059 615.8688 616.4258 617.3620 618.6011 662.7101 681.6097 696.5283 704.3877 705.4422 706.4976 709.9843 741.3373 759.5868 762.0194 773.8436 788.3360 798.0905 804.1549 810.6665 813.6580 832.2104 852.8600 855.5221 859.1062 863.1018 917.4986 918.0662 923.7655 925.3943 974.6370 975.8664 979.4926 980.9893 988.3231 988.7358 988.9743 989.0243 991.9934 992.4002 993.9839 999.1197 1023.2575 1026.8790 1027.4837 1028.4530 1063.3737 1064.4458 1068.8556 1077.4723 1098.8628 1125.9515 1128.5263 1140.0097 1170.3006 1171.1005 1171.3500 1172.8584 1176.1576 1183.0896 1187.9724 1190.0813 1191.0970 1192.2239 1203.1296 1214.8184 1215.7995 1217.5564 1312.6349 1327.0913 1327.9456 1328.9377 1363.6396 1377.6499 1378.6776 1379.5900 1419.6049 1430.7658 1438.6994 1439.2223 1443.7106 1447.2493 1448.7069 1472.2222 1481.0565 1481.8292 1481.9980 1576.7175 1587.3526 1587.9120 1588.2227 1596.6175 1610.3149 1610.5796 1612.2573 2978.0512 2982.0019 2985.5569 3038.9518 3046.0603 3049.7184 3113.3877 3113.5963 3114.1920 3115.6675 3118.6610 3119.6443 3120.9155 3122.8487 3132.1276 3132.7058 3134.0643 3135.3499 3142.2724 3142.6350 3143.2237 3145.5888 3159.6409 3161.0894 3161.4202 3161.5554
redmass: 4.9020 4.5344 4.1348 4.6092 4.7403 4.2682 4.6384 4.6399 3.9644 3.9142 3.8941 4.5043 4.4622 4.7951 4.7988 4.6406 4.7011 4.7829 3.9253 3.9991 2.2311 2.0969 2.1756 6.1038 2.7649 2.8497 2.8448 2.9122 3.7803 3.6027 3.6569 3.7527 4.7101 4.8021 4.6663 3.7889 6.3526 6.0206 6.2480 5.9134 3.7340 5.2217 4.2740 1.8364 1.7614 1.7268 1.8368 1.5761 1.6993 1.7826 1.8944 2.4718 3.3517 3.1521 2.6441 3.1495 1.9169 1.2532 1.2665 1.2495 1.2575 1.4345 1.4345 1.3752 1.3985 1.3805 1.3854 1.4266 1.4073 5.2307 5.9231 5.9176 5.5083 1.3046 1.3358 1.3183 1.3107 3.0601 2.2088 2.2102 2.2259 1.5402 1.5628 1.5872 1.7104 2.6492 1.1279 1.1539 1.1186 1.0525 1.0517 1.0583 1.1048 1.1855 1.2316 1.2181 1.1342 1.1612 1.1360 1.1458 3.2516 3.2236 3.1432 1.4703 1.2749 1.2741 1.2720 4.5003 7.4672 7.7472 7.6434 2.1346 1.4142 2.1245 2.1081 1.5490 1.1424 1.1383 1.9726 2.2912 2.2818 2.2837 5.4320 5.9614 5.9419 5.9485 5.7826 6.0757 6.0794 6.0360 1.0591 1.0586 1.0580 1.0993 1.1006 1.1013 1.0862 1.0862 1.0864 1.0853 1.0863 1.0864 1.0859 1.0865 1.0914 1.0914 1.0917 1.0922 1.0960 1.0960 1.0959 1.0954 1.1015 1.1014 1.1015 1.1014
irintensity: 0.0096 0.0248 0.0403 0.0121 0.0244 0.0447 0.0437 0.0040 0.0973 0.0741 0.1353 0.1601 0.8537 1.5501 1.4923 1.0109 0.6684 0.6129 7.4329 8.0575 3.0894 0.6904 0.9660 13.3871 0.1307 0.0013 0.1245 0.0901 8.2751 3.7596 44.0698 42.1263 1.6619 6.8994 9.7196 0.8808 0.0522 0.3343 0.3586 0.4856 1.3540 1.3023 3.4570 66.9784 59.3213 59.7965 9.9533 24.1488 18.0074 32.3423 65.9318 35.9118 19.9660 4.4672 43.1104 57.3053 74.8471 1.8474 2.6139 1.4910 3.9627 11.1104 9.0951 0.1887 1.2268 0.2383 0.0194 0.3155 0.4180 1.1925 0.3252 0.2597 0.0574 0.3818 1.0891 0.0687 0.0333 2.2478 8.8581 8.8489 8.8599 5.0259 15.3053 30.5854 7.4683 32.8012 0.2871 3.9128 9.7667 0.2771 0.0770 0.8871 5.9472 8.7630 66.8720 18.4595 6.1959 3.2250 2.2161 3.6609 29.4436 33.0208 14.0947 6.6429 1.0423 1.1003 0.2466 1.5554 1.2999 1.5946 1.5776 14.0610 8.5874 6.5950 10.4339 9.6322 6.3112 6.2465 6.1760 44.7761 37.6841 23.0290 0.7461 0.7090 1.1504 1.7034 0.0385 38.5185 20.5424 17.7700 14.6001 16.1761 12.0429 9.1978 6.1215 8.4551 11.0681 11.8239 10.3699 4.2599 3.8878 0.9573 0.5945 0.4576 8.6818 15.4338 29.2929 17.3836 55.1024 26.6355 29.1167 35.4892 34.4996 33.5662 36.8674 7.9771
temp: 298.150 k
press: 1.00000 atm
elementType: 14 6 6 6 6 6 6 6 6 6 6 6 6 6 6 6 6 6 6 6 6 6 6 6 6 6 6 6 1 1 1 1 1 1 1 1 1 1 1 1 1 1 1 1 1 1 1 1 1 1 1 1 1 1
symmnumber: 1
zpe: 1157103.0 jmol-1
zpe.correction: 0.440717 hartree
zpe.thermalcorrener: 0.466327 hartree
zpe.thermalcorrenthalpy: 0.467271 hartree
zpe.thermalcorrgfe: 0.379973 hartree
zpe.sumelectzpe: -1331.938905 hartree
zpe.sumelectthermal: -1331.913296 hartree
zpe.sumelectthermalent: -1331.912352 hartree
zpe.sumelectthermalfe: -1331.999650 hartree
dipole: 0.4912 0.2340 0.5074
dipole: 0.7440
quadrupole: -161.0824 -168.0495 -168.6992
quadrupole: 5.2193 4.9157 4.5731
quadrupole: 4.8613 -2.1058 -2.7555 5.2193 4.9157 4.5731
hfenergy: -1332.3796227 hartree
pointgroup: C01 [X(C27H26Si1)]
dipole: 0.184945 0.0901161 0.2082083 debye
polarizability: 358.4419582|17.0031598|305.7820636|24.3163549|22.1079214|251.3961806 unknown
charge 0 multiplicity 1
54 atoms
Si 0.081303 -0.162851 0.521525
C  -1.524292 -0.171663 1.608164
C  0.832255 -1.957479 0.515148
C  -0.305022 0.332819 -1.309644
C  1.327734 1.075104 1.289515
C  -2.553129 -1.212897 1.207641
C  2.045397 -2.148876 -0.373321
C  -1.069088 1.633356 -1.497056
C  1.048607 1.760711 2.503896
C  2.572973 1.34021 0.649799
C  -2.453784 -2.55399 1.670355
C  3.362667 -2.037498 0.149305
C  -0.496629 2.887605 -1.146257
C  -3.643767 -0.878583 0.359969
C  1.899413 -2.44483 -1.756954
C  -2.379508 1.629549 -2.046701
C  1.972978 2.674387 3.061538
C  3.501069 2.251658 1.202479
C  3.203776 2.922375 2.411889
C  -3.406101 -3.527885 1.296183
C  4.493496 -2.209638 -0.680499
C  -1.212332 4.090964 -1.333699
C  -4.597251 -1.851142 -0.017108
C  3.02774 -2.616698 -2.589275
C  -3.097614 2.832626 -2.236061
C  -4.483005 -3.182082 0.446924
C  4.332486 -2.498475 -2.05559
C  -2.517843 4.071176 -1.877793
H  -1.956041 0.846488 1.557742
H  -1.202779 -0.337134 2.655482
H  0.010162 -2.631113 0.204927
H  1.076477 -2.205543 1.566242
H  -0.864798 -0.506612 -1.765398
H  0.672532 0.375493 -1.830858
H  0.097079 1.593347 3.022514
H  2.828847 0.832037 -0.288032
H  -1.630913 -2.831762 2.341313
H  3.500011 -1.814646 1.214398
H  0.514728 2.920663 -0.725593
H  -3.74981 0.153989 0.007413
H  0.892744 -2.554137 -2.17998
H  -2.831848 0.67513 -2.343612
H  1.731382 3.192926 3.996659
H  4.452402 2.436605 0.690376
H  3.921392 3.63109 2.841061
H  -3.311199 -4.553312 1.671771
H  5.498802 -2.123245 -0.252096
H  -0.748707 5.045037 -1.057107
H  -5.434615 -1.567241 -0.665288
H  2.888902 -2.849853 -3.651327
H  -4.104552 2.80253 -2.668672
H  -5.224674 -3.935219 0.158431
H  5.20847 -2.636192 -2.699208
H  -3.071224 5.005419 -2.02503
