program: Gaussian 09
title: 000233875
version: EM64L-G09RevD.01
frameworkgroup: C1[X(C17H27NO6)]
method: RPBEPBE
basis: SDD
operation: Freq
keyword: #p
keyword: freq=noraman
keyword: PBEPBE/SDD
title: #p freq=noraman PBEPBE/SDD
converged: NO YES NO NO
title: Mulliken charges:
elementType: O O O O O O N C C C C C C C C C C C C C C C C C H H H H H H H H H H H H H H H H H H H H H H H H H H H
charge: -0.312303 -0.449141 -0.453497 -0.257394 -0.216443 -0.215210 -0.355755 -0.049171 0.399692 -0.226206 -0.589108 -0.072606 -0.525590 -0.135460 -0.469557 -0.766268 -0.736316 -0.089025 -0.526741 -0.526758 0.302644 0.154430 0.154653 -0.763641 0.237993 0.251379 0.243337 0.225082 0.213924 0.266510 0.208051 0.221226 0.228138 0.238784 0.221585 0.264607 0.220692 0.218995 0.235231 0.207425 0.250712 0.326604 0.245534 0.245609 0.258369 0.248662 0.361790 0.350311 0.237714 0.247988 0.248521
chargesum: 0.00000
title: Mulliken charges with hydrogens summed into heavy atoms:
elementType: O O O O O O N C C C C C C C C C C C C C C C C C
charge: -0.312303 -0.122538 -0.091707 -0.257394 -0.216443 -0.215210 -0.005444 0.188822 0.399692 0.025173 -0.120690 0.141318 -0.051030 0.085766 -0.002635 -0.059384 -0.074665 0.161687 -0.035598 -0.019727 0.302644 0.154430 0.154653 -0.029418
polarizability: 2.23338454e+02 -1.47807917e+00 1.95047468e+02 -6.02843602e+00 1.02787803e+01 1.88306601e+02
1716.lowfreq: -11.3497 -9.6308 -0.0007 -0.0007 0.0008 3.5476 16.0358 21.9409 28.3831
frequency: 15.5343 21.6863 28.3013 43.3678 48.0516 56.8858 69.7160 74.3857 86.6177 90.9750 136.3224 149.0200 155.6624 177.7719 188.1368 197.2282 200.0022 213.2217 250.4509 263.1972 275.4862 292.4991 294.7789 310.8452 315.8182 330.7235 353.0698 369.7442 390.5256 423.5524 432.2546 433.5093 438.0201 447.7749 471.4486 489.1788 512.8242 516.6046 531.7494 551.9132 566.2207 584.8129 591.4414 601.2304 630.3199 673.5436 724.7481 796.4554 811.2838 822.1341 835.9070 849.6315 863.3868 867.6819 872.7752 896.1236 900.1392 911.8986 939.0617 942.0666 967.3967 979.7792 989.8858 994.3687 999.5315 1013.6217 1037.3932 1039.3817 1056.2110 1078.1048 1091.5336 1096.7108 1105.4867 1118.0084 1137.2927 1146.7086 1155.3192 1158.6783 1170.4026 1189.9648 1215.6840 1226.4665 1246.0820 1252.7190 1255.9004 1271.3963 1273.5438 1277.5304 1291.9227 1301.7523 1310.5297 1316.7678 1319.1750 1328.1621 1334.9795 1348.2762 1351.1752 1355.7576 1358.6776 1366.6507 1371.6139 1376.1364 1379.9872 1383.8814 1390.5894 1397.9887 1440.4217 1445.8513 1452.6203 1453.1108 1455.3105 1457.6598 1464.5571 1469.1989 1476.2273 1481.1908 1486.9861 1637.4273 1639.6788 1642.9049 2943.1727 2950.3572 2976.0537 2978.3472 2978.5739 2982.0518 2984.9949 2989.2167 2991.8582 2996.1887 3004.1200 3009.0402 3020.1311 3047.7599 3056.1567 3067.5210 3073.8577 3075.3923 3081.7682 3081.8271 3090.7800 3096.6571 3111.2543 3137.5759 3481.6860 3544.5863 3561.0349
redmass: 5.7001 6.0815 5.4167 1.0505 4.7633 6.6306 5.1576 5.5990 3.7339 4.7423 4.7084 6.9359 3.6522 1.4434 2.5687 2.1559 2.3373 1.3820 2.5476 2.4971 2.8050 3.4224 1.3747 2.6950 2.6488 2.5665 6.6232 2.9689 3.8509 1.1839 2.7675 4.0190 2.7430 2.8093 3.7684 3.0182 4.1750 4.2824 2.5505 3.1611 3.0669 3.8367 3.2143 3.2652 2.9439 4.7772 5.6881 1.6284 2.0971 2.3521 3.1187 2.0541 2.2923 2.7239 2.6193 2.5589 3.1908 2.1385 2.4492 1.7912 1.6999 2.5730 2.5914 1.9537 2.3316 1.7102 2.0708 1.6825 2.0817 1.7575 1.9340 1.9042 2.0069 1.9232 2.2074 1.3968 1.5218 1.6655 1.3919 2.5259 2.3454 1.5425 1.5686 1.5294 1.9052 1.4876 1.4581 1.8804 1.4014 2.3247 1.4354 1.4214 1.6244 1.8405 1.3396 1.5266 1.4994 1.6300 1.4762 1.4877 1.8261 1.1842 1.2344 1.2197 1.2158 1.3591 1.0836 1.0858 1.0734 1.0731 1.0520 1.0812 1.0610 1.0483 1.0819 1.0552 1.0549 9.1759 10.9890 5.4303 1.0817 1.0804 1.0529 1.0681 1.0661 1.0677 1.0672 1.0424 1.0592 1.0575 1.0378 1.0838 1.0852 1.1012 1.1005 1.0978 1.0952 1.0942 1.0941 1.0976 1.0990 1.0949 1.0994 1.1020 1.0760 1.0658 1.0662
irintensity: 1.1594 0.6558 1.2834 0.5461 1.6628 0.3661 3.9847 1.3133 1.5531 1.7509 1.0225 4.6472 4.2304 1.4229 1.7343 8.3723 2.2125 1.1232 1.8720 1.5603 6.5986 11.1950 74.4482 13.6576 5.4123 4.5454 6.1847 55.3072 7.4694 179.9827 7.1825 2.0558 5.0201 20.6265 9.9910 0.7591 6.5233 15.4715 5.0746 0.1642 4.6937 1.2257 6.2252 1.4674 1.1871 3.4021 10.2449 37.4092 70.2335 16.1784 17.4366 9.8937 3.9095 5.1562 15.4264 23.1329 24.7195 6.2479 24.5831 4.9080 5.3049 21.7031 62.9985 121.6820 33.8465 1.1499 13.5382 9.4754 2.1157 5.8784 9.7733 19.9763 25.8319 19.0920 20.1110 87.3680 6.2275 8.6606 73.0618 213.1545 97.3277 27.2092 16.6714 27.6075 6.3457 28.9383 13.5109 159.4027 1.6006 71.5409 7.0996 12.3689 10.2101 25.9939 4.8973 18.1983 12.8937 11.3640 4.3390 12.6579 19.1327 31.0164 48.3788 22.8985 8.9703 3.9533 10.0432 8.6256 28.0839 16.7987 14.3820 10.5387 14.7631 18.4778 4.7542 12.5695 14.0239 278.8738 45.8283 452.5450 5.8516 13.3571 8.1417 66.4099 14.8191 20.6980 7.4419 8.2939 3.0687 39.6705 3.0658 19.6664 30.5476 53.3175 20.3859 24.1415 18.7723 10.2159 6.3882 41.9721 21.7602 9.4692 10.1431 11.2102 39.1866 4.9090 12.7159
temp: 298.150 k
press: 1.00000 atm
elementType: 8 8 8 8 8 8 7 6 6 6 6 6 6 6 6 6 6 6 6 6 6 6 6 6 1 1 1 1 1 1 1 1 1 1 1 1 1 1 1 1 1 1 1 1 1 1 1 1 1 1 1
symmnumber: 1
zpe: 1115361.9 jmol-1
zpe.correction: 0.424819 hartree
zpe.thermalcorrener: 0.450628 hartree
zpe.thermalcorrenthalpy: 0.451572 hartree
zpe.thermalcorrgfe: 0.367105 hartree
zpe.sumelectzpe: -1168.262726 hartree
zpe.sumelectthermal: -1168.236917 hartree
zpe.sumelectthermalent: -1168.235973 hartree
zpe.sumelectthermalfe: -1168.320440 hartree
dipole: -3.0949 -2.2204 1.4225
dipole: 4.0659
quadrupole: -180.8672 -148.6795 -147.7814
quadrupole: -7.6801 5.6022 -7.1245
quadrupole: -21.7579 10.4299 11.3280 -7.6801 5.6022 -7.1245
hfenergy: -1168.6875446 hartree
pointgroup: C01 [X(C17H27N1O6)]
dipole: -1.2593642 0.7209176 -0.6732105 debye
polarizability: 223.1675122|3.6357663|198.256665|4.9342988|9.0105512|185.2683456 unknown
InChI: InChI=1S/C17H27NO6/c1-9-7-17(3,24-10(2)19)8-12(16(9)23)13(20)4-11-5-14(21)18-15(22)6-11/h9,11-13,16,18,20,23H,4-8H2,1-3H3
charge 0 multiplicity 1
51 atoms
O  -2.335372 1.336836 -0.4851
O  -1.029808 -3.197994 -0.503849
O  0.752166 -2.175985 1.978159
O  -4.573402 1.901514 -0.919415
O  4.316963 -1.338923 -2.092881
O  5.369992 1.874594 1.074856
N  4.77531 0.29779 -0.515487
C  -0.627987 -0.880414 0.346217
C  -2.619789 0.663391 0.862819
C  -1.609607 -2.079702 0.276622
C  -1.213605 0.192695 1.29334
C  -3.002628 -1.656847 -0.243488
C  -3.572757 -0.53792 0.664986
C  0.796888 -1.362516 0.744044
C  1.813407 -0.241682 1.030344
C  -3.186957 1.712895 1.833303
C  -3.980419 -2.848739 -0.31258
C  2.00695 0.793603 -0.110514
C  2.47566 0.164436 -1.448798
C  3.032181 1.880567 0.30179
C  -3.360558 1.9157 -1.233943
C  3.900442 -0.376288 -1.396852
C  4.47176 1.377119 0.347757
C  -2.786955 2.587983 -2.467294
H  -0.561248 -0.439264 -0.672813
H  -1.7258 -2.517186 1.286307
H  -1.277277 -0.221382 2.318579
H  -0.554199 1.078105 1.340843
H  -2.870265 -1.243205 -1.268235
H  -4.541468 -0.184255 0.274049
H  -3.76483 -0.963587 1.672097
H  1.168253 -2.002238 -0.083005
H  1.50045 0.29117 1.948637
H  2.776869 -0.729334 1.275116
H  -2.518155 2.590462 1.889481
H  -4.189004 2.046316 1.520489
H  -3.261518 1.276763 2.846119
H  -4.948743 -2.538416 -0.745998
H  -3.568163 -3.669176 -0.924647
H  -4.175356 -3.253914 0.699119
H  1.040462 1.299085 -0.298921
H  -0.973345 -2.926311 -1.455984
H  2.44603 0.932672 -2.248787
H  1.828248 -0.662282 -1.783414
H  2.807338 2.303779 1.295638
H  3.004267 2.723909 -0.418486
H  0.459848 -3.088088 1.723239
H  5.743865 -0.046062 -0.485778
H  -1.938192 2.016046 -2.874881
H  -2.417293 3.594271 -2.197144
H  -3.575559 2.700807 -3.226259
