program: Gaussian 09
title: 000233855
version: EM64L-G09RevD.01
frameworkgroup: C1[X(C20H28ClNO)]
method: RPBEPBE
basis: SDD
operation: Freq
keyword: #p
keyword: freq=noraman
keyword: PBEPBE/SDD
title: #p freq=noraman PBEPBE/SDD
converged: YES YES NO NO
title: Mulliken charges:
elementType: Cl O N C C C C C C C C C C C C C C C C C C C C H H H H H H H H H H H H H H H H H H H H H H H H H H H H
charge: -0.063525 -0.448211 -0.170183 -0.117266 -0.148263 -0.138799 -0.026284 -0.465743 -0.481714 -0.401684 -0.449968 -0.416442 -0.407350 -0.383454 -0.400331 -0.385747 -0.258556 0.472661 -0.417029 -0.388721 -0.209021 -0.211948 -0.107473 0.212070 0.236225 0.200883 0.178070 0.195578 0.198248 0.203458 0.198466 0.201494 0.217535 0.198423 0.198749 0.204324 0.200182 0.197393 0.198712 0.198778 0.186397 0.194580 0.201196 0.215649 0.214824 0.209152 0.342470 0.242716 0.272242 0.253970 0.253268
chargesum: 0.00000
title: Mulliken charges with hydrogens summed into heavy atoms:
elementType: Cl O N C C C C C C C C C C C C C C C C C C C C
charge: -0.063525 -0.105741 -0.170183 0.094804 0.087962 0.062084 0.151786 -0.071916 -0.079790 0.017345 -0.052796 -0.011936 -0.011244 0.001721 -0.004556 0.044726 -0.049404 0.472661 -0.174313 -0.116479 0.044949 0.041320 -0.107473
polarizability: 2.64645321e+02 -2.94440886e+01 2.15288647e+02 3.80461621e+00 8.62088268e+00 1.90608012e+02
1716.lowfreq: -6.1960 0.0017 0.0017 0.0024 1.7033 8.1835 14.4258 24.3271 41.1060
frequency: 13.6921 24.1108 40.9306 47.3055 76.1189 86.9000 98.7148 115.8409 150.3992 159.9628 187.3442 215.7691 243.6323 254.6107 268.0829 281.4357 294.4305 311.4065 332.6296 344.9335 350.3371 378.5335 381.1007 409.8611 417.4575 428.3027 439.8260 461.7529 479.6804 500.0206 527.0821 540.7758 566.5550 606.5778 621.2762 640.1815 660.8133 720.9081 766.8555 773.3161 784.2998 794.0571 816.9656 828.1706 835.1050 835.9198 853.7847 878.9095 893.5078 906.8326 917.0578 928.8423 939.3885 947.9207 962.7532 970.6768 980.3609 983.8991 1001.2599 1006.6740 1012.9010 1049.6668 1055.1513 1061.5667 1069.7382 1077.2479 1087.8107 1092.4638 1102.8484 1107.1763 1114.3821 1135.9039 1139.9751 1156.0994 1179.7883 1183.4114 1193.5628 1199.6189 1206.6837 1212.2110 1219.7057 1234.1752 1245.2580 1250.5130 1262.2014 1267.0331 1277.2250 1289.8920 1300.1148 1300.7870 1307.9857 1311.2692 1314.3916 1323.5056 1331.2099 1332.7473 1336.7885 1337.9569 1341.3114 1344.2445 1347.0081 1353.1453 1357.8264 1372.1395 1378.2846 1384.6181 1399.4797 1453.1318 1461.9573 1463.1806 1464.0043 1464.8606 1468.2673 1470.9766 1474.9893 1475.9455 1477.8847 1587.2561 1597.9342 2796.7023 2924.1205 2927.1121 2942.6924 2957.3792 2961.9140 2962.5640 2965.4956 2967.9052 2968.6087 2969.8662 2970.9544 2973.1582 2982.5098 3010.9998 3018.4826 3023.4417 3026.7764 3028.0812 3030.3583 3032.5720 3041.7975 3045.4141 3137.2867 3141.4460 3167.6385 3171.4770 3561.5183
redmass: 5.2203 5.7754 3.4337 4.3514 5.2398 3.7395 2.6508 5.3299 3.0676 6.8045 2.5335 3.0047 3.8327 3.8503 2.6940 2.7844 2.6995 2.1065 1.5100 2.3002 2.2170 3.6619 3.4321 2.9030 3.2446 3.3843 2.4767 2.8790 4.7901 2.4277 3.0008 2.6169 2.2035 2.8453 6.6257 4.2910 3.3120 3.5148 3.4100 2.4535 1.7898 2.4527 1.6064 1.4227 1.4035 1.9805 2.2794 1.9859 1.9289 1.6371 2.2669 1.8991 2.4409 1.5250 2.5178 1.3681 2.6433 3.5403 3.5803 2.5438 1.8293 1.5521 1.3867 1.5265 2.6830 1.5048 1.9811 2.2263 1.4304 1.3350 1.8576 2.0488 2.1576 1.9057 1.1141 1.8550 1.6050 2.0025 1.6545 1.5899 1.5804 1.3049 1.2957 1.4081 1.4115 1.3314 1.4533 1.3569 1.4461 1.3122 1.3392 1.3608 1.3823 1.4043 1.4002 1.4430 1.3960 1.4156 1.5089 1.6094 1.4822 1.3988 1.5802 1.4367 1.6072 4.0860 2.1707 1.0977 1.0851 1.0889 1.0893 1.0920 1.0886 1.0839 1.1608 2.1258 1.0899 7.3518 6.2210 1.0790 1.0654 1.0807 1.0791 1.0711 1.0639 1.0620 1.0611 1.0623 1.0651 1.0684 1.0756 1.0782 1.0619 1.0985 1.0974 1.0987 1.0962 1.0959 1.1018 1.1020 1.1036 1.1031 1.0895 1.0886 1.0957 1.0963 1.0661
irintensity: 0.0507 0.1841 0.0753 0.4551 0.0818 0.6690 0.0343 0.3605 0.7367 1.6898 0.2393 2.4111 2.6614 0.8875 1.6460 0.6895 2.0829 3.5924 109.6821 45.3229 1.5936 5.3870 3.6146 0.8827 1.0548 0.7356 0.5611 3.1518 14.7021 3.6204 0.9636 42.1506 5.2285 4.9449 1.0462 3.9036 7.0592 5.2056 15.0419 1.7466 4.8864 4.2904 7.3690 41.0511 22.0236 14.0336 4.2360 1.3678 9.5348 1.4110 7.4105 7.7539 6.5263 15.6651 47.4069 0.6955 4.5518 29.9494 13.3369 44.7149 1.9892 1.5091 0.2589 1.7553 36.5448 0.5873 3.7230 1.0986 1.0419 4.0076 11.6530 17.5252 3.5605 2.9704 0.2682 34.3928 19.1539 7.7200 7.9222 16.5000 29.5347 7.3175 3.2237 4.6233 6.0783 0.0240 6.8261 7.2957 11.1470 1.8097 1.9525 4.2276 8.0097 3.2452 9.4850 5.4970 1.0178 4.2799 11.8758 31.0266 5.7356 8.8918 0.2760 3.1679 0.8282 2.4084 12.9977 8.3257 3.8808 7.3059 6.4418 11.6344 12.5949 23.3928 1.3269 63.8505 6.5895 5.2620 12.0530 87.9357 48.9176 26.2917 20.2797 25.3093 24.1871 12.8246 46.6358 45.0843 36.3473 9.1578 100.0363 44.0632 35.6165 41.9826 42.2565 73.0773 77.2866 47.8191 20.2574 44.3943 83.0516 91.0369 9.0076 2.1083 6.6650 1.1420 6.1559
temp: 298.150 k
press: 1.00000 atm
elementType: 17 8 7 6 6 6 6 6 6 6 6 6 6 6 6 6 6 6 6 6 6 6 6 1 1 1 1 1 1 1 1 1 1 1 1 1 1 1 1 1 1 1 1 1 1 1 1 1 1 1 1
symmnumber: 1
zpe: 1153281.0 jmol-1
zpe.correction: 0.439262 hartree
zpe.thermalcorrener: 0.460665 hartree
zpe.thermalcorrenthalpy: 0.461609 hartree
zpe.thermalcorrgfe: 0.387541 hartree
zpe.sumelectzpe: -1367.196588 hartree
zpe.sumelectthermal: -1367.175185 hartree
zpe.sumelectthermalent: -1367.174240 hartree
zpe.sumelectthermalfe: -1367.248308 hartree
dipole: 2.0959 -0.4777 0.3778
dipole: 2.1826
quadrupole: -152.6753 -147.7151 -142.6814
quadrupole: 5.6587 4.2056 -4.7463
quadrupole: -4.9847 -0.0245 5.0092 5.6587 4.2056 -4.7463
hfenergy: -1367.6358492 hartree
pointgroup: C01 [X(C20H28Cl1N1O1)]
dipole: -0.7494933 0.3932666 0.1447722 debye
polarizability: 243.9406392|-34.9994963|240.0845366|-8.3567657|7.1944729|186.5168045 unknown
InChI: InChI=1S/C20H28ClNO/c21-15-11-9-14(10-12-15)20(23)13-22-18-7-3-1-5-16(18)17-6-2-4-8-19(17)22/h9-12,16-20,23H,1-8,13H2
charge 0 multiplicity 1
51 atoms
Cl 4.579142 -3.830304 0.84391
O  2.460265 2.67868 0.618101
N  -0.633269 0.775331 -0.232323
C  -2.458686 -0.035936 -1.610789
C  -2.975546 0.364665 -0.206582
C  -0.923383 -0.206727 -1.338138
C  -1.905408 1.392622 0.220408
C  -3.144154 -1.22986 -2.31583
C  -4.383406 0.961824 -0.048297
C  -0.526832 -1.649992 -0.921527
C  -2.042087 1.743074 1.713447
C  -2.699234 -2.613936 -1.788632
C  -4.589997 1.384944 1.433432
C  -1.158553 -2.730323 -1.826909
C  -3.465047 2.322624 1.950558
C  0.527183 1.660166 -0.353504
C  1.542225 1.534859 0.819667
C  2.298049 0.215466 0.841492
C  1.949644 -0.806852 1.756577
C  3.357111 -0.016149 -0.074427
C  2.634891 -2.043382 1.763859
C  4.055388 -1.243294 -0.081787
C  3.679298 -2.239584 0.84119
H  -2.586837 0.858485 -2.259355
H  -2.894028 -0.511783 0.471477
H  -0.347275 0.064475 -2.250128
H  -2.098104 2.34283 -0.350342
H  -2.905705 -1.185598 -3.398769
H  -4.244669 -1.119017 -2.237998
H  -5.1635 0.232933 -0.343823
H  -4.494633 1.843729 -0.713354
H  -0.859537 -1.80887 0.12282
H  0.576801 -1.732908 -0.910838
H  -1.279975 2.484162 2.025845
H  -1.885497 0.827727 2.319472
H  -3.168506 -3.410433 -2.398262
H  -3.04756 -2.761455 -0.74595
H  -4.615367 0.471025 2.062461
H  -5.572093 1.882023 1.554793
H  -0.833248 -3.735906 -1.497171
H  -0.807583 -2.608265 -2.873582
H  -3.54182 3.298685 1.42772
H  -3.615683 2.52796 3.027981
H  1.075366 1.460055 -1.295055
H  0.216233 2.728822 -0.378309
H  0.986194 1.654192 1.772905
H  3.197116 2.613549 1.277313
H  1.128938 -0.643075 2.463908
H  3.636993 0.773894 -0.780011
H  2.363001 -2.833317 2.46982
H  4.873685 -1.422038 -0.785563
