program: Gaussian 09
title: 000022171
version: EM64L-G09RevD.01
frameworkgroup: C1[X(C11H17NOS)]
method: RPBEPBE
basis: SDD
operation: Freq
keyword: #p
keyword: freq=noraman
keyword: PBEPBE/SDD
title: #p freq=noraman PBEPBE/SDD
converged: YES YES NO NO
title: Mulliken charges:
elementType: S O N C C C C C C C C C C C H H H H H H H H H H H H H H H H H
charge: 0.180926 -0.437526 -0.313781 0.026186 -0.745213 -0.696440 -0.365843 -0.329161 -0.151378 -0.228833 -0.270284 -0.221002 -0.209258 -0.234921 0.218824 0.248615 0.272132 0.237663 0.232270 0.222693 0.219587 0.166774 0.242448 0.239270 0.172072 0.245521 0.254937 0.229711 0.230714 0.331824 0.231473
chargesum: 0.00000
title: Mulliken charges with hydrogens summed into heavy atoms:
elementType: S O N C C C C C C C C C C C
charge: 0.180926 -0.105702 -0.076118 0.245010 -0.224466 -0.021890 0.043379 0.082181 -0.151378 0.016687 -0.015347 0.008709 0.021456 -0.003448
polarizability: 1.59001686e+02 2.41829964e+01 1.46607660e+02 -9.70291572e+00 2.23400997e-01 1.30507491e+02
1716.lowfreq: -14.5198 -4.2715 0.0010 0.0013 0.0022 10.9254 18.3885 20.5639 33.4498
frequency: 18.0384 20.1020 33.3813 60.4799 78.3147 89.3337 132.0952 158.1486 181.2390 243.8074 260.2234 264.0993 300.4024 314.9502 335.6632 388.0695 404.6774 419.6193 457.3315 483.0857 503.2271 610.4675 674.9068 684.4329 696.1432 702.1208 751.8442 818.8582 823.5351 847.7716 873.9150 918.9291 939.9988 968.4804 973.9950 985.8147 994.6558 1015.4558 1043.6962 1050.5892 1055.5910 1070.5031 1073.4488 1088.4096 1142.0202 1150.9161 1171.2305 1174.5374 1181.5741 1210.2766 1252.4371 1267.2923 1290.3532 1299.1608 1317.5692 1340.6577 1350.3181 1372.0721 1378.3575 1387.2870 1423.4642 1428.1311 1458.0842 1469.0157 1474.0373 1476.9110 1488.1716 1490.9587 1584.6258 1587.7013 2820.3762 2869.1386 2933.1911 2985.6671 3013.9289 3054.3424 3086.9863 3089.0737 3095.0080 3101.0533 3125.0258 3132.5804 3144.9123 3154.3388 3167.3971 3407.8514 3556.3811
redmass: 4.8436 4.0150 2.7909 3.5889 2.0964 5.1116 3.3403 2.5112 3.8158 1.9324 6.0656 1.8540 3.3124 1.6913 1.5897 6.4496 2.8071 2.2258 3.6660 3.1919 3.3482 6.4511 5.7698 1.9482 2.1570 2.6039 1.5108 1.4800 1.5025 1.2468 1.6515 1.3789 2.0615 3.2374 1.4108 5.8694 1.3147 3.2523 2.0540 1.8754 2.2889 1.7157 2.2304 1.5907 1.4824 2.6269 1.0539 1.7569 1.1162 1.4222 1.1731 1.2037 1.1687 1.3241 1.2782 1.3768 1.3264 8.9025 1.2420 1.2952 1.7102 1.2392 2.0853 1.1528 1.1109 1.0949 1.0481 1.0875 6.2464 6.0084 1.0716 1.0814 1.0711 1.0356 1.0593 1.0858 1.1002 1.0994 1.1037 1.0938 1.0848 1.0879 1.0930 1.0963 1.1015 1.0732 1.0660
irintensity: 0.1208 0.3678 1.9065 4.7356 4.0002 1.6696 0.4153 6.0789 0.7713 1.2648 0.5488 0.4086 0.4147 63.3719 101.9982 0.2616 0.2079 7.4081 31.6582 10.4125 11.5144 0.1268 3.8708 63.4773 34.7445 29.9836 70.8571 7.9918 1.4975 0.3357 0.9899 2.9640 15.3836 99.9948 0.1996 3.0500 0.1446 14.8085 14.4516 1.6796 32.6484 8.6310 5.7862 3.1535 8.4582 32.8158 0.1168 42.7715 0.4426 11.7352 1.0163 32.4002 2.5127 0.8784 27.9760 5.4251 13.8494 0.2238 23.2781 20.3543 4.8702 19.0169 30.3816 13.2225 10.6742 12.9107 11.4851 5.4693 1.9014 15.2937 117.0647 68.3819 71.9371 24.3013 22.6151 22.2960 24.8798 21.9456 15.8087 26.6891 1.6273 2.4127 17.5402 26.2041 18.3137 3.4539 7.7820
temp: 298.150 k
press: 1.00000 atm
elementType: 16 8 7 6 6 6 6 6 6 6 6 6 6 6 1 1 1 1 1 1 1 1 1 1 1 1 1 1 1 1 1
symmnumber: 1
zpe: 680162.3 jmol-1
zpe.correction: 0.259060 hartree
zpe.thermalcorrener: 0.274790 hartree
zpe.thermalcorrenthalpy: 0.275734 hartree
zpe.thermalcorrgfe: 0.212760 hartree
zpe.sumelectzpe: -956.287285 hartree
zpe.sumelectthermal: -956.271555 hartree
zpe.sumelectthermalent: -956.270610 hartree
zpe.sumelectthermalfe: -956.333585 hartree
dipole: -1.6982 -2.7884 0.3011
dipole: 3.2787
quadrupole: -114.9882 -89.1438 -85.9304
quadrupole: 6.8689 -0.9289 0.6511
quadrupole: -18.3007 7.5437 10.7570 6.8689 -0.9289 0.6511
hfenergy: -956.5463448 hartree
pointgroup: C01 [X(C11H17N1O1S1)]
dipole: -0.7015309 -1.0781682 -0.096639 debye
polarizability: 160.7370635|25.0537825|144.3587288|-4.5507177|3.6340396|131.0210443 unknown
InChI: InChI=1S/C11H17NOS/c1-10(12-7-8-13)9-14-11-5-3-2-4-6-11/h2-6,10,12-13H,7-9H2,1H3
charge 0 multiplicity 1
31 atoms
S  -1.380759 2.163543 0.025449
O  5.48145 -1.709137 0.040292
N  2.336523 0.334961 -0.429356
C  1.17238 0.854046 0.342385
C  0.324819 1.677632 -0.652746
C  1.632338 1.717423 1.532946
C  3.329322 -0.47376 0.307003
C  4.461446 -0.904195 -0.645564
C  -2.247534 0.533778 -0.067179
C  -2.470262 -0.099999 -1.313613
C  -2.744846 -0.049156 1.122731
C  -3.171609 -1.326189 -1.364783
C  -3.463478 -1.266528 1.063985
C  -3.672191 -1.911183 -0.177196
H  0.534246 0.023434 0.736166
H  0.155303 1.120129 -1.591559
H  0.824769 2.630466 -0.896621
H  2.013075 -0.163979 -1.271956
H  0.759871 2.228281 1.977012
H  2.359193 2.476805 1.190614
H  2.105182 1.110268 2.324492
H  2.885065 -1.387882 0.785807
H  3.769261 0.132885 1.116798
H  4.997565 -0.018895 -1.02041
H  4.042021 -1.456398 -1.517406
H  -2.117768 0.372137 -2.237636
H  -2.566113 0.446259 2.082698
H  -3.342002 -1.812913 -2.331702
H  -3.850647 -1.711784 1.987298
H  5.052391 -2.520546 0.413773
H  -4.224512 -2.856402 -0.220424
