program: Gaussian 09
title: 000233808
version: EM64L-G09RevD.01
frameworkgroup: C1[X(C9H17NO2)]
method: RPBEPBE
basis: SDD
operation: Freq
keyword: #p
keyword: freq=noraman
keyword: PBEPBE/SDD
title: #p freq=noraman PBEPBE/SDD
converged: YES YES NO NO
title: Mulliken charges:
elementType: O O N C C C C C C C C C H H H H H H H H H H H H H H H H H
charge: -0.422693 -0.245933 -0.646130 -0.038241 0.210715 -0.509477 -0.477944 -0.453741 -0.444309 0.091269 -0.362053 -0.697572 0.235585 0.221063 0.218445 0.240336 0.234246 0.224299 0.212966 0.212239 0.192128 0.268333 0.306967 0.212803 0.195904 0.210617 0.211838 0.215761 0.382578
chargesum: 0.00000
title: Mulliken charges with hydrogens summed into heavy atoms:
elementType: O O N C C C C C C C C C
charge: -0.040115 -0.245933 -0.070829 0.197344 0.210715 -0.069968 -0.003362 -0.016476 -0.039942 0.091269 0.046655 -0.059356
polarizability: 1.11402760e+02 -1.09524518e-02 1.12989739e+02 2.14911587e+00 -2.01790444e+00 9.66295408e+01
1716.lowfreq: -15.1197 -7.3034 0.0002 0.0004 0.0005 9.7774 31.1754 54.3414 67.3532
frequency: 29.0138 54.2453 67.3326 88.6928 116.8106 124.9498 153.7987 215.6933 236.4615 254.8175 273.0739 298.9785 342.9213 392.8979 431.0525 454.3677 518.2420 540.3104 587.1238 623.7280 638.4593 704.4405 720.2216 738.4981 793.1057 837.8595 853.8457 898.3916 909.6211 915.8054 960.8490 1002.8131 1025.3324 1033.6071 1044.5819 1055.0636 1083.4574 1093.5427 1127.6112 1137.7423 1189.1412 1204.5962 1216.7342 1235.1385 1241.4899 1261.1541 1277.1936 1292.6137 1293.9431 1301.6728 1313.5962 1333.3957 1344.4466 1351.8369 1388.7265 1462.0868 1463.0377 1470.4856 1474.1493 1477.7302 1486.2495 1488.7137 1599.3623 1653.5010 2953.3424 2968.4693 2972.3630 2978.5297 2983.8481 3000.7543 3005.8953 3028.7490 3030.0620 3045.4805 3069.0158 3069.4961 3071.9072 3102.2371 3479.1298 3519.1720 3619.4416
redmass: 1.8676 7.0850 3.1017 1.7143 2.9859 2.9606 2.7824 1.2375 1.1460 3.5410 2.7654 3.0227 2.7411 4.8881 3.0608 2.4564 1.6327 2.6885 1.3541 3.2150 2.9775 4.5292 2.1586 1.1139 1.8216 1.3585 2.0855 1.7734 2.5493 2.3182 1.9007 1.8129 2.2583 2.2952 2.8188 2.3995 1.6234 1.9619 2.5182 2.1175 1.2934 1.6179 1.2181 1.6254 1.4076 1.3374 1.3202 1.1703 1.3947 1.3775 1.5270 1.4938 2.1995 1.6635 1.2132 1.0830 1.0796 1.0748 1.0650 1.0429 1.0792 1.0917 1.3940 3.2737 1.0588 1.0593 1.0368 1.0783 1.0698 1.0974 1.0625 1.0953 1.0697 1.0986 1.1007 1.1013 1.0994 1.1051 1.0448 1.0640 1.0989
irintensity: 0.0281 1.7749 0.0202 0.0659 0.2057 0.5628 5.5477 41.8046 0.0424 0.7029 4.8822 0.2842 12.0138 4.0744 3.4475 47.0827 191.1643 33.7625 101.3654 39.5151 45.0607 47.0467 2.7437 7.1001 4.4052 1.0633 4.6752 3.4941 11.2614 0.5374 2.9233 8.6572 36.2569 3.6144 124.5328 77.5449 40.3152 13.2119 3.0086 1.6387 0.6639 0.7748 1.1252 2.5478 1.1417 2.2008 4.8874 0.6444 3.0531 0.3949 13.9201 3.3181 8.4673 3.4203 11.0743 7.6227 4.9469 2.3913 5.8058 12.3291 13.8790 4.0003 163.9253 142.1404 8.5947 49.7984 33.8591 15.9793 23.3712 4.4163 50.5992 33.7099 22.7180 8.2394 51.4139 62.9459 57.0554 28.9179 9.4565 28.6261 8.8277
temp: 298.150 k
press: 1.00000 atm
elementType: 8 8 7 6 6 6 6 6 6 6 6 6 1 1 1 1 1 1 1 1 1 1 1 1 1 1 1 1 1
symmnumber: 1
zpe: 658533.8 jmol-1
zpe.correction: 0.250822 hartree
zpe.thermalcorrener: 0.264644 hartree
zpe.thermalcorrenthalpy: 0.265588 hartree
zpe.thermalcorrgfe: 0.209700 hartree
zpe.sumelectzpe: -557.389613 hartree
zpe.sumelectthermal: -557.375792 hartree
zpe.sumelectthermalent: -557.374848 hartree
zpe.sumelectthermalfe: -557.430735 hartree
dipole: 1.3671 1.3320 -1.3114
dipole: 2.3158
quadrupole: -76.6841 -74.0558 -72.3648
quadrupole: 0.0001 4.8537 6.3235
quadrupole: -2.3159 0.3125 2.0034 0.0001 4.8537 6.3235
hfenergy: -557.6404356 hartree
pointgroup: C01 [X(C9H17N1O2)]
dipole: 0.6044257 0.4760484 -0.4880503 debye
polarizability: 111.3136129|0.1541933|113.0837609|2.2908167|-1.7859208|96.6246663 unknown
InChI: InChI=1S/C9H17NO2/c1-2-4-7-5-3-6-9(7,10)8(11)12/h7,11H,2-6,10H2,1H3
charge 0 multiplicity 1
29 atoms
O  -1.792306 -1.2207 -1.562763
O  -1.541879 -2.25131 0.494505
N  -1.012174 0.121628 1.750065
C  0.475471 0.421053 -0.34165
C  -0.969917 0.145331 0.280724
C  0.644026 1.959744 -0.14919
C  -1.768111 1.359918 -0.274618
C  -0.80033 2.563803 -0.088719
C  1.604797 -0.438962 0.256491
C  -1.468516 -1.210417 -0.199462
C  2.971833 -0.219156 -0.434338
C  4.084596 -1.112958 0.154316
H  0.398132 0.206711 -1.427241
H  1.239208 2.396931 -0.969932
H  1.198685 2.165598 0.787423
H  -2.719101 1.477993 0.269845
H  -1.987683 1.19836 -1.343792
H  -0.976459 3.054182 0.88642
H  -0.962623 3.331894 -0.865223
H  1.337609 -1.514059 0.183837
H  1.704054 -0.216147 1.339149
H  -0.515374 0.886303 2.210215
H  -0.85215 -0.801557 2.162709
H  3.267438 0.845061 -0.343423
H  2.868153 -0.422716 -1.519965
H  4.229995 -0.907288 1.231758
H  3.828452 -2.184283 0.050793
H  5.05129 -0.945336 -0.355252
H  -2.063112 -2.14372 -1.818279
