program: Gaussian 09
title: 000233809
version: EM64L-G09RevD.01
frameworkgroup: C1[X(C9H17NO2)]
method: RPBEPBE
basis: SDD
operation: Freq
keyword: #p
keyword: freq=noraman
keyword: PBEPBE/SDD
title: #p freq=noraman PBEPBE/SDD
converged: YES YES NO NO
title: Mulliken charges:
elementType: O O N C C C C C C C C C H H H H H H H H H H H H H H H H H
charge: -0.426204 -0.240121 -0.601336 -0.034468 0.162774 -0.476226 -0.528943 -0.409937 -0.107940 0.094998 -0.728569 -0.731859 0.245900 0.207732 0.225379 0.229305 0.236215 0.232791 0.199631 0.212123 0.272986 0.275185 0.212033 0.213426 0.231907 0.207464 0.210954 0.236412 0.378385
chargesum: 0.00000
title: Mulliken charges with hydrogens summed into heavy atoms:
elementType: O O N C C C C C C C C C
charge: -0.047818 -0.240121 -0.053165 0.211432 0.162774 -0.043115 -0.063423 0.022485 0.104184 0.094998 -0.071203 -0.077029
polarizability: 1.11682753e+02 2.54833029e+00 1.12593008e+02 -1.49415077e+00 -8.18418167e-01 9.66437212e+01
1716.lowfreq: -4.1222 -0.0004 -0.0003 0.0003 8.1865 19.3064 57.2748 66.1817 98.3752
frequency: 57.2276 65.8677 98.3506 126.3054 150.9935 186.1842 210.8432 219.6516 240.3394 245.9330 276.9792 314.2606 337.5304 376.9152 387.2404 448.8508 474.8765 496.2452 586.2757 615.0481 636.4384 695.7315 704.6590 731.8312 804.6446 846.2720 875.8872 918.8685 921.4232 925.8724 955.3990 965.0851 983.3721 1027.6491 1028.5593 1041.5472 1058.0793 1108.3725 1119.3455 1154.5871 1178.3372 1189.7231 1222.1711 1230.3094 1257.9704 1275.4197 1284.5570 1294.7194 1307.0954 1315.1257 1319.0779 1328.5988 1345.6083 1378.5932 1397.1351 1457.9793 1466.7252 1470.0810 1473.9736 1480.1741 1484.1381 1493.7658 1633.2915 1654.8714 2958.8504 2969.5657 2972.3964 2993.0505 3000.6839 3004.1978 3021.6593 3054.7640 3059.5569 3066.8013 3067.7719 3068.2707 3078.8755 3090.8800 3440.4305 3503.0030 3555.4209
redmass: 7.7400 2.4682 2.9078 2.3223 3.1191 2.4422 1.4515 1.0710 1.3017 1.9643 2.7058 2.3023 4.0822 2.8953 2.7019 2.8034 2.8510 3.9697 1.3182 2.9974 2.6157 2.2617 4.2711 1.4555 1.7293 2.6064 1.7011 1.2588 2.5327 2.5791 1.7851 1.9691 1.8174 2.5362 2.3950 2.1793 1.6802 1.9148 2.1382 2.2338 1.8593 1.4780 1.8611 1.2522 1.3586 1.8469 1.7403 1.4524 1.4180 1.3626 1.3413 1.3936 1.4952 1.2073 1.2078 1.0788 1.0747 1.0609 1.0519 1.0790 1.0641 1.0509 6.0682 1.1609 1.0820 1.0359 1.0363 1.0833 1.0601 1.0596 1.0644 1.1026 1.0994 1.0999 1.1025 1.0990 1.0986 1.1039 1.0456 1.0641 1.0952
irintensity: 2.2594 0.6161 0.0190 0.2216 1.2855 0.8718 19.4409 12.1264 4.1085 13.8825 3.9221 0.5793 16.3433 10.3747 1.5497 5.1236 3.4863 16.9997 105.6113 2.2316 8.1641 87.2762 37.2471 108.1529 3.7029 12.6385 4.2925 2.4670 1.7936 16.9260 12.0941 15.4334 18.8564 4.2203 52.0471 112.9024 14.8859 2.1720 0.1282 1.4019 6.8224 2.5373 2.3471 3.4027 2.1704 7.8458 1.4948 0.1743 3.2347 2.1679 1.3289 2.9708 1.6077 16.9404 17.0203 1.5373 15.1602 4.8756 3.1551 4.5260 3.5418 24.2391 160.4059 120.0288 10.2357 30.4112 30.9024 11.8416 15.1177 63.3531 51.7441 5.0255 2.7836 46.0914 34.5376 36.2982 43.5461 62.4620 0.6356 13.3764 0.9281
temp: 298.150 k
press: 1.00000 atm
elementType: 8 8 7 6 6 6 6 6 6 6 6 6 1 1 1 1 1 1 1 1 1 1 1 1 1 1 1 1 1
symmnumber: 1
zpe: 659532.1 jmol-1
zpe.correction: 0.251203 hartree
zpe.thermalcorrener: 0.264671 hartree
zpe.thermalcorrenthalpy: 0.265615 hartree
zpe.thermalcorrgfe: 0.212109 hartree
zpe.sumelectzpe: -557.390811 hartree
zpe.sumelectthermal: -557.377343 hartree
zpe.sumelectthermalent: -557.376399 hartree
zpe.sumelectthermalfe: -557.429905 hartree
dipole: 0.4618 0.1887 -1.0291
dipole: 1.1436
quadrupole: -74.4072 -74.7493 -72.2568
quadrupole: -3.0934 3.3104 2.2485
quadrupole: -0.6028 -0.9448 1.5476 -3.0934 3.3104 2.2485
hfenergy: -557.6420139 hartree
pointgroup: C01 [X(C9H17N1O2)]
dipole: 0.1874882 0.070449 -0.4028928 debye
polarizability: 112.0943805|2.6293528|112.2112348|-1.4652448|-0.2762983|96.6138673 unknown
InChI: InChI=1S/C9H17NO2/c1-6(2)7-4-3-5-9(7,10)8(11)12/h6-7,11H,3-5,10H2,1-2H3
charge 0 multiplicity 1
29 atoms
O  -1.597646 -0.864596 -1.635499
O  -2.344298 -1.459237 0.473817
N  -0.598358 0.397093 1.746375
C  0.811843 0.257449 -0.321499
C  -0.641974 0.353785 0.27605
C  1.357641 1.714379 -0.175703
C  -1.115046 1.742315 -0.259004
C  0.120659 2.659246 -0.068263
C  1.746624 -0.815001 0.30096
C  -1.597474 -0.745548 -0.234892
C  1.171221 -2.250603 0.212596
C  3.13651 -0.771368 -0.384854
H  0.68876 0.019698 -1.397504
H  2.004384 1.976135 -1.032417
H  1.972745 1.790075 0.738858
H  -2.011257 2.103457 0.27928
H  -1.37376 1.645277 -1.328215
H  0.091328 3.126381 0.929974
H  0.138085 3.467887 -0.821395
H  1.893517 -0.553753 1.370849
H  -0.221511 -0.460254 2.166521
H  -1.513065 0.616863 2.158129
H  0.979954 -2.52953 -0.841514
H  1.889798 -2.981211 0.628279
H  0.222794 -2.367609 0.768133
H  3.043677 -0.991501 -1.466369
H  3.813817 -1.526536 0.055769
H  3.617993 0.216822 -0.279383
H  -2.254061 -1.565817 -1.898482
