program: Gaussian 09
title: 000233791
version: EM64L-G09RevD.01
frameworkgroup: C1[X(C4H6ClN5)]
method: RPBEPBE
basis: SDD
operation: Freq
keyword: #p
keyword: freq=noraman
keyword: PBEPBE/SDD
title: #p freq=noraman PBEPBE/SDD
converged: NO YES NO NO
title: Mulliken charges:
elementType: Cl N N N N N C C C C H H H H H H
charge: -0.044558 -0.354586 -0.116119 -0.020024 -0.587678 -0.545845 0.250240 -0.306017 -0.012705 -0.135438 0.262835 0.331828 0.337368 0.331872 0.304493 0.304335
chargesum: 0.00000
title: Mulliken charges with hydrogens summed into heavy atoms:
elementType: Cl N N N N N C C C C
charge: -0.044558 -0.022758 -0.116119 -0.020024 0.081561 0.062982 0.250240 -0.043182 -0.012705 -0.135438
polarizability: 1.16115397e+02 4.10350913e+00 1.17882387e+02 9.09031110e-03 9.57886370e-03 3.97981472e+01
1716.lowfreq: -0.0009 0.0011 0.0018 4.5389 8.4350 9.0533 99.1568 146.0056 160.4284
frequency: 99.1563 146.0043 160.4275 183.8780 228.0369 252.8839 318.0096 361.0207 390.9820 470.7395 476.0443 507.1224 530.9324 566.7910 601.4649 617.2981 647.8443 668.8354 764.5044 813.4396 867.3191 898.1438 966.2698 1046.8080 1135.0902 1227.7762 1245.5128 1307.6951 1339.4799 1371.3648 1446.5539 1503.4802 1535.1206 1573.2988 1613.0325 1662.1637 3212.5082 3441.4203 3540.4665 3562.4700 3573.9195 3720.9164
redmass: 4.0761 4.3987 5.4750 5.3080 7.7997 4.4388 1.1397 6.9696 5.3421 2.4205 1.2047 1.8072 1.0581 6.4147 2.2890 1.6260 7.0997 3.6715 4.7843 1.7875 7.8573 8.3893 2.6712 3.0218 1.5037 4.9005 1.1774 6.9910 3.4026 2.0427 3.5660 2.3751 4.2423 5.8365 1.7438 1.0797 1.0935 1.0406 1.0778 1.0443 1.1050 1.1060
irintensity: 3.5252 1.3017 2.2088 10.8141 0.0803 6.1147 2.1137 12.6006 0.3462 112.0747 295.7468 212.5365 2.3212 1.7882 119.7180 94.8806 43.3055 11.9569 5.4275 35.5268 56.5075 9.3432 28.5827 0.3004 21.5598 28.5206 0.3904 32.8796 52.2661 140.2537 96.9672 33.7457 416.1480 580.4349 495.8681 21.1450 0.1400 1.0703 61.0239 119.6329 3.2553 51.2993
temp: 298.150 k
press: 1.00000 atm
elementType: 17 7 7 7 7 7 6 6 6 6 1 1 1 1 1 1
symmnumber: 1
zpe: 302632.6 jmol-1
zpe.correction: 0.115267 hartree
zpe.thermalcorrener: 0.124880 hartree
zpe.thermalcorrenthalpy: 0.125824 hartree
zpe.thermalcorrgfe: 0.080340 hartree
zpe.sumelectzpe: -889.087512 hartree
zpe.sumelectthermal: -889.077899 hartree
zpe.sumelectthermalent: -889.076954 hartree
zpe.sumelectthermalfe: -889.122438 hartree
dipole: -2.7695 0.7931 0.0080
dipole: 2.8808
quadrupole: -69.1689 -49.1512 -66.0199
quadrupole: 8.0169 0.0123 0.0265
quadrupole: -7.7222 12.2955 -4.5732 8.0169 0.0123 0.0265
hfenergy: -889.2027787 hartree
pointgroup: C01 [X(C4H6Cl1N5)]
dipole: -0.7825015 0.802075 0.1702478 debye
dipolederiv: -0.2136996 0.2307693 0.037513 0.2294368 -0.9142042 -0.1183295 0.0370222 -0.1176343 -0.1235347 -0.9548827 0.2034835 0.0666941 0.5653439 -0.0623325 -0.0004171 0.1145725 0.0311007 -0.4922499 -1.4141534 -0.3301978 0.0607009 -0.1750209 -0.5982837 -0.0233965 0.0794544 -0.0114148 -0.2802045 -0.788965 -0.2942469 0.0172109 -0.5094109 -1.4480491 -0.108536 -0.0099563 -0.1275464 -0.2076392 -0.9290516 -0.6827433 -0.0658241 -0.7498761 -0.9190941 0.0438408 -0.0744331 0.0376554 -0.7220719 -0.4691811 0.2587425 0.072672 0.5292013 -0.3120464 -0.084146 0.1050709 -0.0604339 -0.019259 1.6435628 -0.0606918 -0.1354223 -0.5696707 0.8258438 0.1255204 -0.1980089 0.080966 0.2428217 -0.8100443 0.1990988 0.0743211 0.5515667 -0.743336 -0.1109864 0.11676 -0.0789327 -0.2575812 1.4953592 0.6582496 -0.0317729 0.7811024 1.4823136 0.0869592 -0.0157498 0.0986189 0.2271111 1.2419375 -0.0265018 -0.108187 -0.0662551 1.771229 0.2148396 -0.1128051 0.211064 0.0845051 0.0437678 -0.0754103 0.0055002 -0.0697371 0.0395685 -0.0143979 0.0064738 -0.0136635 0.2076404 0.1381202 -0.0709732 0.0102107 -0.1234072 0.1476048 -0.012572 0.0026493 -0.0166633 0.3438164 0.2759118 0.0671787 0.0183812 0.0219109 0.1855827 -0.0279114 0.0124078 -0.0320254 0.3905744 0.1744015 0.0198314 0.021566 0.0710151 0.2575501 -0.0233906 0.0275358 -0.0194123 0.3896721 0.2720072 -0.0333764 -0.099425 -0.2280911 0.1245509 0.1248656 -0.0942639 0.0683979 0.1391704 0.2949097 -0.0632122 0.0558611 -0.2581081 0.1631026 -0.0719423 0.0032704 -0.0500763 0.0772289 unknown
polarizability: 119.5088043|3.6184677|112.8582432|-6.6100116|8.5834788|41.4288842 unknown
InChI: InChI=1S/C4H6ClN5/c5-2-1-3(10-7)9-4(6)8-2/h1,10H,6-7H2
charge 0 multiplicity 1
16 atoms
Cl 1.241129 -2.907496 -0.483717
N  -2.326361 0.859568 0.290848
N  -0.075296 1.433288 0.159302
N  1.667231 -0.248542 -0.199434
N  2.190522 2.020969 0.033822
N  -3.446606 0.020911 0.289784
C  -1.016679 0.438827 0.119887
C  -0.672984 -0.935191 -0.076757
C  1.224155 1.046971 -0.00242
C  0.702134 -1.175935 -0.22749
H  -1.414339 -1.731816 -0.10689
H  -2.482903 1.860623 0.423971
H  3.163961 1.753391 -0.082939
H  1.917522 2.988916 0.178264
H  -3.51797 -0.606618 1.096111
H  -3.670214 -0.401468 -0.616241
