program: Gaussian 09
title: 000022148
version: EM64L-G09RevD.01
frameworkgroup: C1[X(C6H12S2)]
method: RPBEPBE
basis: SDD
operation: Freq
keyword: #pfreq=noraman
keyword: PBEPBE/SDD
title: #p freq=noraman PBEPBE/SDD
converged: YES YES NO NO
title: Mulliken charges:
elementType: S S C C C C C C H H H H H H H H H H H H
charge: 0.203066 0.209811 -0.394400 -0.396317 -0.653316 -0.630299 -0.587877 -0.613880 0.271179 0.261382 0.275945 0.251473 0.219216 0.224013 0.221048 0.237848 0.223391 0.203509 0.241394 0.232813
chargesum: 0.00000
title: Mulliken charges with hydrogens summed into heavy atoms:
elementType: S S C C C C C C
charge: 0.203066 0.209811 -0.394400 -0.125138 -0.115989 0.064403 0.094410 0.063836
polarizability: 1.15591103e+02 3.65122338e+00 9.28528784e+01 -4.77033460e+00 1.73885595e+00 7.94099417e+01
1716.lowfreq: -23.2011 -3.0287 0.0014 0.0020 0.0021 17.5250 46.9123 160.9981 225.7813
frequency: 43.7675 160.9841 225.7804 230.2079 250.1675 266.2715 280.2379 316.8474 338.0850 340.8394 358.8680 402.7237 505.5045 515.3828 588.7482 614.9766 679.1513 856.8596 901.0686 913.3354 938.7202 995.0470 1004.6329 1049.9531 1083.8536 1105.3598 1160.0846 1169.4670 1185.7265 1210.1455 1258.1101 1309.8544 1380.2406 1384.6613 1397.8022 1433.9208 1450.6135 1454.6197 1462.6057 1468.0410 1471.9238 1473.0522 2973.0639 2977.3897 2982.9296 3015.9535 3029.7630 3068.2444 3071.8956 3074.4784 3096.3213 3097.1567 3102.1581 3110.6680
redmass: 3.9158 3.0450 1.2697 1.1018 1.8603 1.8579 1.3644 2.9027 3.0192 2.8973 2.7292 6.4176 4.0834 4.8451 5.1030 3.5207 3.9880 2.1538 2.0161 2.2845 1.4506 1.3040 1.3564 1.4762 1.3128 1.6462 1.9905 2.0024 2.9807 1.3788 1.2526 1.3714 1.2016 1.2128 1.1925 1.0843 1.0479 1.0479 1.0464 1.0463 1.0451 1.0470 1.0390 1.0359 1.0366 1.0696 1.0720 1.0996 1.0952 1.0989 1.0988 1.1071 1.1010 1.0992
irintensity: 2.1432 1.5094 0.4451 0.2366 0.6474 0.8007 0.0965 2.1554 1.2706 1.2547 1.0612 1.3552 6.0814 2.7813 5.0214 5.1161 3.6523 3.2557 2.9162 5.2830 0.3491 3.8182 7.8362 1.9972 5.4402 31.2571 47.1919 1.0338 5.2884 11.1107 2.9153 9.5338 14.9546 37.4936 11.6493 6.9153 3.5350 9.7152 16.0795 8.1920 6.0689 17.0347 39.9833 18.7344 32.6921 6.4459 34.1425 0.2253 25.0820 37.8930 21.3966 9.6664 15.8078 17.9113
temp: 298.150 k
press: 1.00000 atm
elementType: 16 16 6 6 6 6 6 6 1 1 1 1 1 1 1 1 1 1 1 1
symmnumber: 1
zpe: 438062.1 jmol-1
zpe.correction: 0.166849 hartree
zpe.thermalcorrener: 0.176794 hartree
zpe.thermalcorrenthalpy: 0.177738 hartree
zpe.thermalcorrgfe: 0.132084 hartree
zpe.sumelectzpe: -1031.304993 hartree
zpe.sumelectthermal: -1031.295048 hartree
zpe.sumelectthermalent: -1031.294104 hartree
zpe.sumelectthermalfe: -1031.339758 hartree
dipole: 0.5592 0.4056 -0.7398
dipole: 1.0122
quadrupole: -57.7660 -70.2041 -64.8917
quadrupole: 2.3955 -2.0697 -2.0852
quadrupole: 6.5213 -5.9168 -0.6045 2.3955 -2.0697 -2.0852
hfenergy: -1031.4718418 hartree
pointgroup: C01 [X(C6H12S2)]
dipole: 0.2161208 0.2811216 -0.1812507 debye
dipolederiv: -0.5196498 0.0437579 -0.0047558 0.0476165 -0.2203501 0.0003504 0.0246024 -0.0116227 -0.2221531 -0.3299868 0.0057242 0.0095616 -0.0201879 -0.2810047 -0.0538405 -0.0532314 -0.029393 -0.1722039 0.6150319 0.006239 0.0129798 -0.0604028 0.3553751 0.0791736 -0.0413912 0.0843546 0.2545934 0.4343011 0.0498634 0.090764 0.1111599 0.0597146 -0.0157628 0.1979602 -0.0431779 0.0823529 0.085592 -0.0539613 -0.1262574 0.002665 0.0358949 -0.0124765 -0.129735 -0.0510435 0.1316257 -0.0717439 -0.041255 0.0242631 0.0018823 -0.0596134 0.0567401 -0.0149314 0.0308626 -0.0421409 -0.0935113 0.0280465 -0.0519896 0.001295 -0.0759486 0.0427338 -0.0155821 0.0211027 -0.086895 -0.0668966 0.0836322 -0.0705625 0.0095153 -0.0204646 0.0396815 -0.0325336 0.0451288 -0.0465944 -0.0556979 -0.0101306 0.0772272 0.0045056 0.041305 0.0094184 0.0577336 0.0316998 -0.078828 -0.0282119 -0.1037706 -0.0242375 -0.0959613 0.0261996 -0.0371583 -0.0467415 -0.0600045 0.0554558 0.0109292 0.0665262 -0.0148161 0.0515085 0.009994 0.0515649 0.0309659 0.1226885 -0.091679 0.0258924 0.0815395 -0.1007514 0.0527912 0.0525913 0.055312 -0.0665133 0.0683387 0.0150694 -0.0355917 0.0541653 0.1044989 0.0868769 0.0351028 -0.0654057 0.1313269 -0.0288742 0.019846 0.0290055 -0.0951878 -0.0342117 -0.1139239 -0.0126291 -0.0462166 -0.0734388 -0.0871343 0.0248319 -0.0759316 0.1022335 0.0517061 0.1189427 0.0470255 -0.0404758 0.0944104 -0.0556372 0.0223982 0.0511223 -0.0928511 0.0851957 -0.0516717 -0.008239 0.0945404 0.0506303 0.0828972 0.0226251 0.0198162 -0.051279 -0.0822468 -0.0824291 -0.0099208 -0.0975815 -0.1032355 -0.0739407 0.0100664 -0.1563983 -0.0836392 -0.0551172 -0.1383383 0.016688 -0.0043695 -0.0763013 0.0064249 0.0785161 0.0780189 -0.0292218 0.1184535 -0.0195624 0.1013547 -0.0132698 0.0392997 0.0220061 -0.0500906 0.0839103 0.0395686 -0.0097039 0.0937182 -0.0930753 -0.0429582 0.0267056 -0.0746758 0.0732041 unknown
polarizability: 115.4834097|5.5100629|87.8980082|-3.4514785|6.4997063|84.4725052 unknown
InChI: InChI=1S/C6H12S2/c1-5-4-7-6(2,3)8-5/h5H,4H2,1-3H3
charge 0 multiplicity 1
20 atoms
S  0.123341 -1.164812 -0.925235
S  -0.208642 1.066699 1.184708
C  -1.183625 -0.192003 0.124397
C  1.659229 -0.088683 -0.536464
C  1.14344 1.297127 -0.108757
C  -1.904313 -1.168281 1.069672
C  -2.147344 0.53237 -0.83154
C  2.561394 -0.767794 0.505072
H  2.181951 0.003232 -1.507004
H  1.938786 1.894062 0.370679
H  0.728343 1.855678 -0.964051
H  -1.186756 -1.683759 1.727738
H  -2.639384 -0.626695 1.694961
H  -2.452816 -1.929182 0.484795
H  -2.927337 1.065671 -0.256825
H  -1.614971 1.264408 -1.461584
H  -2.639526 -0.196424 -1.502995
H  3.500254 -0.193647 0.6364
H  2.044003 -0.827908 1.478205
H  2.825972 -1.791056 0.188626
