program: Gaussian 09
title: 000233797
version: EM64L-G09RevD.01
frameworkgroup: C1[X(C13H10BrNOS)]
method: RPBEPBE
basis: SDD
operation: Freq
keyword: #p
keyword: freq=noraman
keyword: PBEPBE/SDD
title: #p freq=noraman PBEPBE/SDD
converged: YES YES NO NO
title: Mulliken charges:
elementType: Br S O N C C C C C C C C C C C C C H H H H H H H H H H
charge: 0.002729 0.173911 -0.418674 -0.448327 -0.596702 0.424750 0.576619 -0.350934 0.117615 -0.327179 -0.387103 -0.282678 -0.200025 -0.256709 -0.336640 -0.234908 -0.166029 0.307459 0.303284 0.278849 0.231625 0.241603 0.226607 0.261882 0.229805 0.254543 0.374629
chargesum: 0.00000
title: Mulliken charges with hydrogens summed into heavy atoms:
elementType: Br S O N C C C C C C C C C C C C C
charge: 0.002729 0.173911 -0.044045 -0.145044 -0.289243 0.424750 0.576619 -0.350934 0.117615 -0.048329 -0.155478 -0.041076 0.026581 -0.026905 -0.074758 -0.234908 0.088514
polarizability: 2.77520008e+02 -1.43641411e+01 1.88795391e+02 -9.66660265e+00 -1.31188679e+01 9.86434546e+01
1716.lowfreq: -7.2170 -3.5875 0.0013 0.0016 0.0027 5.1207 24.3811 43.7525 68.1983
frequency: 24.3109 43.7319 68.1954 113.6850 114.4597 174.3119 193.3033 214.9001 238.3743 265.5461 289.8050 313.1151 338.9279 356.0895 410.1750 422.2129 442.0537 452.4454 472.4251 524.2747 537.8570 552.5099 569.6318 605.8080 624.6709 669.1721 684.8988 720.2757 745.1685 747.5947 785.3027 824.1647 844.6110 847.5120 883.4442 912.0442 922.1960 953.3956 966.0764 1016.6793 1033.5209 1062.0648 1074.8579 1117.5817 1125.1116 1159.8557 1168.7609 1178.1088 1194.5756 1246.3679 1259.1752 1270.4137 1295.1805 1344.4300 1364.2776 1392.4981 1409.1850 1415.0705 1459.9167 1464.7671 1472.5117 1574.1484 1594.5649 1603.2314 1617.5138 2915.4702 3130.3557 3143.0536 3153.5590 3163.0490 3164.6196 3172.0690 3182.7751 3474.4557 3565.8076
redmass: 6.7010 7.3281 5.7264 8.6015 7.7203 5.5676 5.6639 6.3289 4.9888 6.8654 6.6383 4.7591 2.5002 2.4982 1.4297 3.0655 3.4255 3.6771 3.4779 4.0205 4.3282 5.7172 5.8874 6.5329 6.7381 6.7401 5.5194 3.0026 2.6156 1.7056 5.8860 1.4491 1.4023 5.3027 5.1034 1.3947 1.3815 1.3459 1.3111 3.9990 2.6168 2.2730 3.2261 1.7158 1.7215 1.4934 1.0672 1.3658 1.5816 1.5598 1.4104 1.9634 1.7021 1.6797 2.6116 3.7667 3.7837 2.7391 2.1187 3.0895 3.5147 7.2280 5.9856 7.0866 7.0709 1.0845 1.0863 1.0890 1.0946 1.0889 1.0919 1.1003 1.0976 1.0671 1.0776
irintensity: 0.4540 0.6598 1.1936 1.3595 0.9432 1.6353 1.2833 16.3336 10.0912 5.5359 3.7818 16.6240 57.3355 35.8322 102.7212 2.7557 1.5072 13.2090 10.8073 25.0431 12.6370 24.8843 7.9653 13.8013 4.1478 14.2750 3.4051 10.2939 24.0933 81.5507 3.2814 43.3093 3.0350 13.8929 15.3049 9.4829 3.6509 0.8520 0.0933 32.0424 5.7600 3.0274 22.2169 23.8823 14.2233 200.2218 2.9459 14.7830 40.3987 39.5412 4.6441 35.2193 21.8634 77.2405 146.2816 22.4388 7.2154 7.0438 23.1715 96.5162 195.7956 5.0911 2.0589 42.1721 7.3689 40.9211 4.2927 4.4592 20.1968 1.5508 0.5178 24.4380 4.0619 116.5398 25.1006
temp: 298.150 k
press: 1.00000 atm
elementType: 35 16 8 7 6 6 6 6 6 6 6 6 6 6 6 6 6 1 1 1 1 1 1 1 1 1 1
symmnumber: 1
zpe: 513486.6 jmol-1
zpe.correction: 0.195577 hartree
zpe.thermalcorrener: 0.210480 hartree
zpe.thermalcorrenthalpy: 0.211424 hartree
zpe.thermalcorrgfe: 0.151696 hartree
zpe.sumelectzpe: -1041.683982 hartree
zpe.sumelectthermal: -1041.669079 hartree
zpe.sumelectthermalent: -1041.668134 hartree
zpe.sumelectthermalfe: -1041.727863 hartree
dipole: 1.5244 -0.4005 1.7617
dipole: 2.3639
quadrupole: -109.2345 -114.4655 -116.4901
quadrupole: -6.0185 -0.1391 -5.7931
quadrupole: 4.1622 -1.0688 -3.0934 -6.0185 -0.1391 -5.7931
hfenergy: -1041.8795589 hartree
pointgroup: C01 [X(C13H10Br1N1O1S1)]
dipole: 0.5882903 0.1144736 0.7111549 debye
polarizability: 277.466288|15.6964679|184.7921014|1.0260491|-24.0564721|102.7004639 unknown
InChI: InChI=1S/C13H10BrNOS/c14-8-5-6-11(16)9(7-8)13-15-10-3-1-2-4-12(10)17-13/h1-7,13,15-16H
charge 0 multiplicity 1
27 atoms
Br -3.888399 -3.305174 -0.233253
S  0.814685 1.310656 -1.15419
O  -2.096395 2.592134 0.039299
N  0.813462 -0.541388 0.808825
C  -0.068923 0.556999 0.427276
C  -1.501217 0.18929 0.149425
C  2.172677 -0.351061 0.497614
C  2.40069 0.622613 -0.517433
C  -2.458567 1.235196 0.011063
C  -1.933414 -1.15426 0.053362
C  3.268301 -1.046539 1.054255
C  3.68984 0.903325 -0.988539
C  4.573606 -0.7644 0.581505
C  4.789875 0.199997 -0.427685
C  -3.829413 0.940377 -0.145096
C  -3.301351 -1.434207 -0.114928
C  -4.260083 -0.40151 -0.200635
H  -0.028345 1.388222 1.16515
H  0.536661 -1.138923 1.588037
H  -1.193896 -1.958306 0.104117
H  3.110426 -1.79334 1.840391
H  3.85033 1.649207 -1.773474
H  5.425507 -1.300715 1.013373
H  -4.541583 1.765115 -0.23533
H  5.804019 0.411942 -0.78063
H  -5.321276 -0.634163 -0.324831
H  -1.139216 2.732014 -0.191668
