program: Gaussian 09
title: 000233755
version: EM64L-G09RevD.01
frameworkgroup: C1[X(C8H16N2O4S)]
method: RPBEPBE
basis: SDD
operation: Freq
keyword: #p
keyword: freq=noraman
keyword: PBEPBE/SDD
title: #p freq=noraman PBEPBE/SDD
converged: YES YES NO NO
title: Mulliken charges:
elementType: S O O O O N N C C C C C C C C H H H H H H H H H H H H H H H H
charge: 0.178019 -0.296381 -0.299008 -0.316380 -0.302772 -0.366422 -0.376315 -0.666692 -0.640792 -0.246028 -0.283321 0.349050 0.326533 -0.606230 -0.608818 0.249454 0.264000 0.295718 0.248691 0.242690 0.224509 0.235387 0.286612 0.328276 0.327768 0.227479 0.232202 0.268433 0.227252 0.226978 0.270112
chargesum: 0.00000
title: Mulliken charges with hydrogens summed into heavy atoms:
elementType: S O O O O N N C C C C C C C C
charge: 0.178019 -0.296381 -0.299008 -0.316380 -0.302772 -0.038147 -0.048547 -0.153238 -0.096383 0.221171 0.238678 0.349050 0.326533 0.121883 0.115524
polarizability: 1.56068247e+02 7.09592865e+00 1.29940728e+02 3.52043373e+00 -8.74575260e+00 1.12910236e+02
1716.lowfreq: -16.3150 -11.1683 0.0006 0.0006 0.0018 5.3897 7.3489 23.2238 31.9332
frequency: -13.7056 22.5154 31.7677 45.0048 64.4653 70.2762 83.1468 100.5734 107.6117 127.5162 139.2386 165.8126 191.1745 193.5289 226.2416 263.4366 289.8507 339.4302 345.7164 413.6058 429.6994 491.8454 503.0389 573.7553 578.7875 596.2865 620.9708 639.5468 648.3452 684.9588 700.3868 798.4437 813.4325 863.2793 879.8240 935.4256 950.3554 996.9517 1001.8125 1049.8188 1063.6954 1107.0086 1111.1491 1126.5245 1127.1189 1145.4063 1145.5884 1182.5505 1191.8421 1206.5981 1209.7455 1226.1975 1235.9464 1297.5129 1305.5193 1360.2319 1370.2396 1422.4095 1427.7026 1429.2189 1431.7648 1444.9545 1459.0793 1464.0760 1465.2231 1484.0872 1484.3368 1518.7074 1519.9349 1673.5687 1677.1224 2975.9707 2979.9129 3007.0644 3016.0339 3019.3135 3032.3422 3052.2454 3057.5549 3073.5541 3095.9014 3104.8097 3109.9235 3114.3606 3127.3474 3577.8964 3578.0952
redmass: 4.4724 4.7497 4.8375 5.1943 5.3484 4.4268 2.9225 1.3745 1.1122 3.9294 3.9903 3.2206 5.3506 4.3878 3.5805 3.0591 2.8014 3.3435 3.1006 3.7581 3.1895 3.3478 2.9554 1.1148 1.1352 3.7776 4.6718 5.4133 5.5621 11.6516 11.7807 2.4294 2.9589 2.6916 2.5591 2.7696 2.5999 2.2231 1.8478 2.6711 2.4748 5.2299 4.8547 1.2839 1.2804 1.7764 1.7085 1.3411 1.3382 2.0538 1.9646 1.1795 1.2221 1.1627 1.1663 1.2428 1.2262 1.0874 1.1624 1.1656 1.0944 1.1012 1.1559 1.2796 1.1873 1.0486 1.0461 1.4499 1.4805 8.4014 8.3778 1.0355 1.0356 1.0567 1.0617 1.0609 1.0589 1.1025 1.1025 1.1067 1.1037 1.1058 1.0979 1.0981 1.1031 1.0772 1.0772
irintensity: 0.7434 0.9489 1.2712 4.4050 5.2374 4.7719 11.0388 3.5084 0.5342 1.3129 2.0397 4.4830 5.5813 0.4801 3.0598 5.1840 4.8253 23.5465 32.8603 5.6787 13.5060 7.7555 4.7030 127.2460 138.7476 1.2696 0.4876 4.8739 12.1754 38.2612 25.1998 4.8243 4.9735 11.3926 9.1428 65.3177 21.7537 22.5713 33.6777 6.7321 4.9207 234.1424 253.3765 0.6650 0.2235 11.3677 21.6953 86.1464 32.1513 192.2502 143.1860 6.6168 11.8658 31.3440 9.1705 2.4482 0.4850 17.1969 35.9637 31.5085 4.3440 14.1996 41.0176 129.8200 91.0342 16.5041 15.3344 167.6328 155.1413 284.0450 277.4320 85.4831 74.3593 16.2987 12.2477 53.3238 20.1647 40.5146 38.6717 12.2713 13.5113 11.2844 4.1251 4.8324 0.7040 20.9239 52.6616
temp: 298.150 k
press: 1.00000 atm
elementType: 16 8 8 8 8 7 7 6 6 6 6 6 6 6 6 1 1 1 1 1 1 1 1 1 1 1 1 1 1 1 1
symmnumber: 1
zpe: 653252.4 jmol-1
zpe.correction: 0.248811 hartree
zpe.thermalcorrener: 0.266381 hartree
zpe.thermalcorrenthalpy: 0.267326 hartree
zpe.thermalcorrgfe: 0.200606 hartree
zpe.sumelectzpe: -1121.723353 hartree
zpe.sumelectthermal: -1121.705782 hartree
zpe.sumelectthermalent: -1121.704838 hartree
zpe.sumelectthermalfe: -1121.771558 hartree
dipole: -2.0025 1.1626 -2.6041
dipole: 3.4847
quadrupole: -83.3949 -83.8327 -98.6781
quadrupole: 4.7371 -5.4522 -6.5842
quadrupole: 5.2403 4.8025 -10.0429 4.7371 -5.4522 -6.5842
hfenergy: -1121.9721639 hartree
pointgroup: C01 [X(C8H16N2O4S1)]
dipole: -0.9228195 0.7223058 -0.7115027 debye
polarizability: 154.6466522|7.9410315|135.415269|4.3245808|1.1755937|108.8572905 unknown
InChI: InChI=1S/C8H16N2O4S/c1-9-7(11)13-3-5-15-6-4-14-8(12)10-2/h9-10H,3-6H2,1-2H3
charge 0 multiplicity 1
31 atoms
S  -0.277996 -0.774333 -1.463467
O  -3.386164 -0.87903 -0.458454
O  1.805266 0.903149 0.292379
O  -2.280105 -0.091649 1.484631
O  3.777605 -0.330809 0.72661
N  -3.777949 1.237716 0.252515
N  3.786437 1.68773 -0.485908
C  -1.561494 -2.161294 -1.535496
C  0.716606 -1.325987 0.062671
C  -2.597704 -2.127295 -0.406863
C  1.014614 -0.145261 0.985981
C  -3.067451 0.094385 0.518406
C  3.194972 0.663576 0.217325
C  -3.676771 2.43393 1.091015
C  5.229107 1.733788 -0.728892
H  -1.038597 -3.135128 -1.535402
H  -2.051828 -2.03007 -2.514953
H  1.644303 -1.813284 -0.27646
H  0.099261 -2.054283 0.616133
H  -2.130771 -2.209658 0.591099
H  -3.331083 -2.94335 -0.53867
H  1.585663 -0.496807 1.865481
H  0.086144 0.356272 1.295864
H  -4.35024 1.243321 -0.591877
H  3.173864 2.421243 -0.842612
H  -4.671059 2.748124 1.457918
H  -3.214044 3.274756 0.541186
H  -3.040678 2.189919 1.956331
H  5.693004 2.617186 -0.251121
H  5.453549 1.753555 -1.811559
H  5.673539 0.824992 -0.292712
