program: Gaussian 09
title: 000022147
version: EM64L-G09RevD.01
frameworkgroup: C1[X(C4H8OS2)]
method: RPBEPBE
basis: SDD
operation: Freq
keyword: #pfreq=noraman
keyword: PBEPBE/SDD
title: #p freq=noraman PBEPBE/SDD
converged: YES YES NO NO
title: Mulliken charges:
elementType: S S O C C C C H H H H H H H H
charge: 0.188155 0.211088 -0.431490 -0.477036 -0.653599 -0.251938 -0.825584 0.306212 0.290056 0.270725 0.218112 0.216178 0.306310 0.294889 0.337923
chargesum: 0.00000
title: Mulliken charges with hydrogens summed into heavy atoms:
elementType: S S O C C C C
charge: 0.188155 0.211088 -0.093568 -0.170824 -0.092818 0.182352 -0.224385
polarizability: 8.17999995e+01 9.66176141e-01 8.26538016e+01 -8.30145448e+00 -4.98918703e+00 6.11098819e+01
1716.lowfreq: -9.7855 0.0020 0.0031 0.0035 8.9482 16.4512 45.9434 103.6783 150.9771
frequency: 45.6361 103.6628 150.9614 222.8282 319.5876 376.9866 429.8469 467.6339 536.1283 591.0537 637.2911 669.5850 674.8868 841.5561 856.7732 963.3921 1002.2495 1007.1999 1046.9158 1081.4748 1142.2531 1175.7590 1183.6209 1204.7748 1259.0883 1290.1079 1330.1853 1371.4630 1430.6932 1436.8972 1466.4822 2980.0900 3025.4509 3042.4648 3053.5933 3063.1587 3105.6104 3141.2120 3476.9344
redmass: 2.9032 3.9689 4.7276 3.7725 2.4392 9.0743 4.7132 1.1298 5.6970 5.0060 6.6907 3.8757 7.3327 1.5177 1.5848 1.5604 4.1392 2.3285 1.5507 1.0482 1.0942 1.3773 1.4412 1.1549 1.2503 1.3064 1.2122 1.2257 1.0877 1.0774 1.0826 1.0616 1.0584 1.0856 1.0534 1.0997 1.1078 1.1137 1.0649
irintensity: 4.1048 8.7552 2.3329 2.3046 0.1995 0.9804 2.3133 164.1021 3.7610 8.1349 4.5450 8.4299 2.1690 5.2219 9.8335 41.2661 36.3285 16.3143 19.6594 2.3570 25.7994 7.8070 0.7656 0.4309 3.8713 15.8449 25.1779 28.7357 11.8407 2.5044 5.0895 33.1106 15.5516 2.3617 27.2948 25.4865 8.6133 4.5202 6.6417
temp: 298.150 k
press: 1.00000 atm
elementType: 16 16 8 6 6 6 6 1 1 1 1 1 1 1 1
symmnumber: 1
zpe: 306276.8 jmol-1
zpe.correction: 0.116655 hartree
zpe.thermalcorrener: 0.124677 hartree
zpe.thermalcorrenthalpy: 0.125621 hartree
zpe.thermalcorrgfe: 0.083055 hartree
zpe.sumelectzpe: -1027.982430 hartree
zpe.sumelectthermal: -1027.974408 hartree
zpe.sumelectthermalent: -1027.973463 hartree
zpe.sumelectthermalfe: -1028.016030 hartree
dipole: 1.8820 -0.1767 0.8708
dipole: 2.0812
quadrupole: -68.3834 -54.8228 -55.8630
quadrupole: 2.0363 -1.2810 -5.0556
quadrupole: -8.6937 4.8669 3.8267 2.0363 -1.2810 -5.0556
hfenergy: -1028.0990849 hartree
pointgroup: C01 [X(C4H8O1S2)]
dipole: 0.7618319 -0.130103 0.2704199 debye
dipolederiv: -0.3012437 -0.0498196 -0.0469531 -0.055498 -0.2642881 -0.0085043 -0.0695298 0.0371368 -0.1488999 -0.2606401 0.0434187 0.0239476 -0.005156 -0.1275898 0.0554849 -0.0303395 0.0347908 -0.1011633 -0.7018441 0.1820407 -0.1218055 0.2094908 -0.3299903 -0.0471032 -0.1726912 -0.0395116 -0.5564428 0.0135618 0.1810353 0.0145729 0.1598327 0.3119709 0.0059984 0.0501073 -0.0171 -0.0217091 0.1064413 -0.0289089 -0.1020983 0.062572 -0.0178461 -0.069516 -0.097918 -0.069579 0.1920678 0.4562471 -0.0925071 -0.0220214 -0.1986009 0.2331051 -0.0237422 0.1137762 0.0424774 0.2941773 0.2736527 0.0151498 -0.0360979 -0.0160019 0.1797397 0.0137858 -0.0163584 -0.0318324 0.092792 0.015744 -0.0318704 0.0832587 -0.0241753 0.0429211 -0.0034377 0.0248351 0.0126421 -0.0340716 -0.027798 -0.0055649 -0.0197716 -0.0200322 0.0872778 -0.0216381 -0.0367787 0.0450827 -0.1213767 0.0989901 -0.0220546 0.0205447 -0.020873 -0.093691 0.0024444 0.0213986 -0.0258389 0.0831338 0.0106092 -0.0771881 -0.0117547 -0.0382443 -0.1247757 0.0221849 -0.0159006 0.020861 0.0803605 -0.0149814 0.0632572 0.1222945 0.0209479 0.0465888 0.0258714 0.0690861 -0.0247752 -0.0868393 -0.0861929 -0.0467341 -0.0094789 -0.0450436 -0.0326973 -0.0568097 -0.0150566 -0.073384 0.0264185 0.0488363 -0.0035557 0.0267432 0.0055399 -0.0039645 0.0562003 0.0426081 0.0727658 -0.0387071 0.3686177 -0.1266986 0.0786197 -0.0347581 0.0932394 0.0487812 0.1327614 0.0162645 0.3402598 unknown
polarizability: 80.5268665|2.2980763|83.6862258|-9.5255233|-1.2038837|61.3505908 unknown
InChI: InChI=1S/C4H8OS2/c5-1-4-2-6-3-7-4/h4-5H,1-3H2
charge 0 multiplicity 1
15 atoms
S  -0.118605 1.424173 0.477905
S  1.838775 -0.593383 -0.856979
O  -2.718518 -0.01252 -0.539926
C  -0.543097 -0.440771 0.591098
C  0.780667 -1.212972 0.587528
C  -1.514748 -0.84071 -0.539145
C  1.497322 1.226431 -0.509012
H  -1.04904 -0.53779 1.569007
H  1.33629 -1.064217 1.526688
H  0.626859 -2.292213 0.410529
H  -1.880773 -1.868907 -0.364836
H  -0.988554 -0.804387 -1.514688
H  2.304844 1.661116 0.096338
H  1.402373 1.736348 -1.478224
H  -2.423394 0.933203 -0.642383
