program: Gaussian 09
title: 000233713
version: EM64L-G09RevD.01
frameworkgroup: C1[X(C13H22N2)]
method: RPBEPBE
basis: SDD
operation: Freq
keyword: #pfreq=noraman
keyword: PBEPBE/SDD
title: #p freq=noraman PBEPBE/SDD
converged: YES YES NO NO
title: Mulliken charges:
elementType: N N C C C C C C C C C C C C C H H H H H H H H H H H H H H H H H H H H H H
charge: -0.144120 -0.144281 -0.325820 -0.416588 -0.404183 -0.416526 -0.404349 -0.045321 -0.053971 -0.045519 -0.053885 -0.588876 -0.589881 -0.588819 -0.589811 0.217593 0.217526 0.234271 0.192133 0.239653 0.188568 0.234328 0.191980 0.239567 0.188605 0.232229 0.233598 0.232198 0.233582 0.216433 0.218049 0.215646 0.217888 0.216464 0.218072 0.215671 0.217896
chargesum: 0.00000
title: Mulliken charges with hydrogens summed into heavy atoms:
elementType: N N C C C C C C C C C C C C C
charge: -0.144120 -0.144281 0.109299 0.009815 0.024039 0.009782 0.023823 0.186909 0.179627 0.186680 0.179697 -0.154395 -0.156347 -0.154283 -0.156244
polarizability: 1.66987753e+02 -6.93224676e-02 1.63159970e+02 -1.52563664e+01 -5.03825615e-02 1.56205659e+02
1716.lowfreq: -9.0768 -4.4832 0.0003 0.0005 0.0007 11.0578 26.8831 34.4318 44.3436
frequency: 26.7936 34.2962 44.3142 64.2040 73.7803 78.9948 81.0439 88.7912 93.7129 100.0822 168.6815 173.3390 201.8481 217.4096 252.3769 303.2212 330.8397 378.5911 380.0572 387.6729 391.1729 443.0730 461.5029 480.5506 524.0627 605.7303 622.9915 650.8693 656.8601 829.1297 847.0016 899.6431 901.5068 919.0515 934.2747 940.4769 944.0160 945.4488 945.8273 956.0159 963.5400 973.5913 977.8875 1009.9721 1011.3531 1012.1014 1013.5490 1025.2963 1095.9792 1110.8072 1115.8636 1145.6475 1150.8846 1154.8054 1160.8217 1167.2376 1235.3607 1236.8139 1253.2155 1260.3105 1271.1129 1273.9411 1275.7998 1276.1254 1283.8743 1342.6058 1344.7257 1350.5446 1352.1829 1392.3690 1423.5166 1423.6368 1426.6560 1428.5385 1460.7597 1461.0719 1466.4301 1466.9526 1481.1442 1654.6503 1654.7266 1656.1520 1656.2465 2861.3905 2862.0399 2868.9325 2870.5296 2883.7937 2922.5532 2997.6298 2997.8864 2999.2352 3000.2947 3082.2336 3082.3953 3083.1888 3083.2138 3098.4812 3098.6282 3099.0720 3099.2449 3193.6400 3193.7249 3195.0072 3195.0847
redmass: 4.1927 3.6936 3.8176 3.6449 3.1960 2.2842 1.9799 2.7337 2.0672 2.4243 2.7805 2.7276 2.5869 2.4394 2.1640 2.9059 2.9059 2.3017 2.3902 2.4842 2.2182 1.9712 2.3543 2.1566 2.0899 1.4794 1.6645 1.6076 1.7420 3.3666 2.6962 1.5078 1.4725 1.4309 1.5871 1.4860 1.3414 1.3366 1.3781 1.6707 2.0436 2.0625 1.9438 1.2268 1.2033 1.1571 1.1830 1.8054 2.0247 2.0905 1.9894 2.3007 1.9883 2.4420 2.3160 2.5232 1.2485 1.1355 1.3675 1.3557 1.3142 1.2535 1.2456 1.2422 1.3510 1.3833 1.3611 1.3783 1.4173 1.2847 1.1930 1.1941 1.2093 1.2265 1.0907 1.0934 1.0826 1.0872 1.0798 4.7257 4.7281 4.7474 4.7413 1.0697 1.0702 1.0655 1.0688 1.0582 1.1039 1.0870 1.0868 1.0881 1.0882 1.0606 1.0604 1.0611 1.0612 1.0924 1.0925 1.0930 1.0932 1.1141 1.1141 1.1141 1.1141
irintensity: 0.0016 0.6698 0.0130 0.2782 0.2096 0.0100 0.6837 1.2997 0.0500 0.4946 1.6193 0.1861 0.0096 1.8988 10.2214 3.0462 4.3491 0.2119 5.6661 3.9034 4.7842 1.2259 0.4266 8.6176 15.5339 3.4086 4.0304 13.3998 0.9003 4.3649 25.0917 7.1940 4.7003 0.0014 8.5312 22.9573 49.6218 224.7641 3.5722 13.4352 21.4150 64.7131 0.6912 68.7439 15.9020 1.7062 16.8839 6.1109 5.7137 93.4835 24.8430 50.0419 20.2368 0.1527 13.1538 42.4258 32.1767 12.1063 35.1688 4.5709 0.9437 3.4006 6.4548 0.5639 19.0534 4.2737 2.8349 0.0360 0.1338 20.7551 7.5245 12.0341 11.3668 9.4940 5.4061 13.5811 0.7329 11.5613 0.5632 0.1549 22.9614 14.2090 12.0659 33.1626 37.0262 1.6201 224.4069 135.9509 59.3614 16.2800 7.3335 9.2551 20.3205 23.3116 1.0939 10.5605 24.8457 5.7243 0.2905 14.1244 14.7323 10.2383 41.1139 25.5256 31.2143
temp: 298.150 k
press: 1.00000 atm
elementType: 7 7 6 6 6 6 6 6 6 6 6 6 6 6 6 1 1 1 1 1 1 1 1 1 1 1 1 1 1 1 1 1 1 1 1 1 1
symmnumber: 1
zpe: 837662.6 jmol-1
zpe.correction: 0.319049 hartree
zpe.thermalcorrener: 0.337551 hartree
zpe.thermalcorrenthalpy: 0.338495 hartree
zpe.thermalcorrgfe: 0.270293 hartree
zpe.sumelectzpe: -616.763496 hartree
zpe.sumelectthermal: -616.744994 hartree
zpe.sumelectthermalent: -616.744050 hartree
zpe.sumelectthermalfe: -616.812252 hartree
dipole: -0.0040 -0.8884 0.0026
dipole: 0.8884
quadrupole: -95.6871 -91.3362 -91.1278
quadrupole: -0.0119 -2.8321 0.0057
quadrupole: -2.9701 1.3808 1.5892 -0.0119 -2.8321 0.0057
hfenergy: -617.0825449 hartree
pointgroup: C01 [X(C13H22N2)]
dipole: 0.007318 -0.0050417 -0.3494024 debye
polarizability: 169.3648276|14.1920028|153.8334203|-0.0747027|0.3321345|163.1551347 unknown
InChI: InChI=1S/C13H22N2/c1-5-9-14(10-6-2)13-15(11-7-3)12-8-4/h5-8H,1-4,9-13H2
charge 0 multiplicity 1
37 atoms
N  -1.214059 0.033014 -0.11066
N  1.214601 -0.031774 -0.069279
C  0.014186 -0.00899 -0.930562
C  -2.413795 0.501617 -0.847845
C  -1.434633 -1.216287 0.663084
C  2.437026 -0.52039 -0.754474
C  1.412593 1.237024 0.678148
C  -2.321523 1.962961 -1.238341
C  -2.353767 -1.001736 1.845172
C  2.352278 -1.989522 -1.116281
C  2.291688 1.051926 1.895213
C  -2.628979 2.463934 -2.460982
C  -3.42415 -1.776737 2.154056
C  2.698042 -2.51751 -2.317126
C  3.353552 1.832596 2.218859
H  0.06352 -0.915519 -1.579262
H  -0.013181 0.882088 -1.601744
H  -3.274417 0.370324 -0.161652
H  -2.631129 -0.11815 -1.753696
H  -0.432266 -1.518966 1.026561
H  -1.825197 -2.046443 0.023117
H  3.273973 -0.376902 -0.041962
H  2.687812 0.07883 -1.665538
H  0.399394 1.550694 0.999818
H  1.826424 2.049191 0.029821
H  -2.006522 2.637766 -0.428172
H  -2.087232 -0.149547 2.488298
H  2.008047 -2.645765 -0.302752
H  2.001897 0.217236 2.5511
H  -2.586796 3.538904 -2.66883
H  -2.937607 1.811539 -3.288039
H  -4.030346 -1.590264 3.047642
H  -3.719982 -2.625617 1.52397
H  2.658688 -3.596538 -2.50337
H  3.036091 -1.883825 -3.147206
H  3.929694 1.668167 3.136325
H  3.672375 2.664065 1.576892
