program: Gaussian 09
title: 000233710
version: EM64L-G09RevD.01
frameworkgroup: C1[X(C8H15ClO2S)]
method: RPBEPBE
basis: SDD
operation: Freq
keyword: #p
keyword: freq=noraman
keyword: PBEPBE/SDD
title: #p freq=noraman PBEPBE/SDD
converged: YES YES NO NO
title: Mulliken charges:
elementType: Cl S O O C C C C C C C C H H H H H H H H H H H H H H H
charge: -0.074283 0.170380 -0.256499 -0.255265 -0.479323 -0.348645 -0.268805 -0.644930 0.287383 -0.681492 -0.604561 -0.527584 0.243864 0.239542 0.209940 0.226880 0.247285 0.234567 0.272168 0.246217 0.223607 0.209702 0.208855 0.303515 0.278202 0.261529 0.277750
chargesum: 0.00000
title: Mulliken charges with hydrogens summed into heavy atoms:
elementType: Cl S O O C C C C C C C C
charge: -0.074283 0.170380 -0.256499 -0.255265 0.004083 0.088176 0.213047 -0.126546 0.287383 -0.039328 -0.022844 0.011695
polarizability: 1.39089205e+02 -1.07881518e+01 1.24729757e+02 -9.77862785e+00 6.47751360e-01 9.68357097e+01
1716.lowfreq: -7.4043 -0.0015 -0.0008 0.0014 8.3371 13.3219 26.0295 32.3635 42.3233
frequency: 25.2302 31.2659 42.0829 55.9292 71.3904 81.5682 90.0599 129.9881 181.4848 193.0664 209.9467 228.6305 260.4804 308.0262 314.8524 337.1778 385.4942 485.9402 548.5881 601.3940 632.8853 663.3171 684.5939 737.4903 755.8467 789.6430 850.6874 866.0204 900.4039 947.0467 964.7032 998.6950 1052.4228 1059.9541 1068.4636 1089.2737 1106.7851 1117.3885 1133.0589 1193.3589 1218.0711 1221.4362 1231.9701 1261.9026 1279.3292 1285.6454 1294.7337 1300.6987 1350.9030 1365.6144 1393.5225 1426.6126 1440.0305 1452.1932 1456.1572 1470.5746 1474.1106 1478.3794 1486.1940 1647.8612 2974.3236 2982.3759 3001.7831 3015.8979 3025.3657 3038.4352 3048.4192 3055.0444 3062.5149 3077.9815 3079.3754 3083.5499 3100.0513 3116.5117 3151.9760
redmass: 4.3093 6.4124 1.8664 4.4427 2.8103 4.7707 4.0262 3.0648 4.2825 3.0435 5.6280 1.0850 6.3117 4.0240 3.0692 2.9795 3.8618 2.8938 2.9296 4.1692 8.1233 5.1199 5.4521 1.1746 1.1685 2.6515 2.7791 1.3396 1.9239 2.2577 1.5728 2.0996 2.4361 2.7948 2.9319 2.1909 2.2099 1.1087 2.3845 1.2526 1.2009 1.2879 1.1464 1.1690 1.2136 1.1842 1.2505 1.2359 1.3744 1.5548 1.2151 1.0881 1.0849 1.0927 1.1008 1.0855 1.0516 1.0421 1.0799 9.2011 1.0363 1.0641 1.0615 1.0569 1.0604 1.0960 1.0598 1.0988 1.0564 1.0996 1.1010 1.1068 1.1042 1.1070 1.1111
irintensity: 0.3134 0.5514 0.0978 1.3393 0.6902 0.7321 2.3996 2.5093 7.1116 1.8875 15.1154 0.0146 3.0935 3.1722 0.6447 13.2005 6.8882 7.9268 6.8095 10.7429 73.2649 7.8252 0.8195 14.3736 4.3976 4.4937 4.3796 0.4951 7.3171 51.8117 6.1163 24.4260 14.4020 7.4141 2.0581 111.6655 35.5609 6.6235 132.2173 0.6298 2.4715 1.0270 14.7042 1.9874 22.8965 8.5754 21.7307 20.4273 5.1785 27.1724 8.1152 10.2440 26.5467 12.7715 8.6812 20.3994 4.5281 13.0593 16.1528 134.5323 36.1684 4.8713 23.4505 7.5004 49.7469 1.5819 0.5700 0.9210 16.9661 51.7988 67.2643 8.8079 9.2988 1.3559 11.2860
temp: 298.150 k
press: 1.00000 atm
elementType: 17 16 8 8 6 6 6 6 6 6 6 6 1 1 1 1 1 1 1 1 1 1 1 1 1 1 1
symmnumber: 1
zpe: 577462.4 jmol-1
zpe.correction: 0.219944 hartree
zpe.thermalcorrener: 0.235346 hartree
zpe.thermalcorrenthalpy: 0.236290 hartree
zpe.thermalcorrgfe: 0.173912 hartree
zpe.sumelectzpe: -1321.445326 hartree
zpe.sumelectthermal: -1321.429924 hartree
zpe.sumelectthermalent: -1321.428980 hartree
zpe.sumelectthermalfe: -1321.491359 hartree
dipole: -1.6317 2.9766 -0.0815
dipole: 3.3955
quadrupole: -88.9381 -87.9875 -88.2830
quadrupole: 8.4485 0.2379 -6.3680
quadrupole: -0.5352 0.4154 0.1199 8.4485 0.2379 -6.3680
hfenergy: -1321.6652703 hartree
pointgroup: C01 [X(C8H15Cl1O2S1)]
dipole: -0.6058861 0.3759727 1.1296719 debye
polarizability: 134.622557|10.47528|102.1638661|-15.7952127|6.4363325|123.8682487 unknown
InChI: InChI=1S/C8H15ClO2S/c1-2-3-8(10)11-5-7-12-6-4-9/h2-7H2,1H3
charge 0 multiplicity 1
27 atoms
Cl 4.671437 0.353574 -2.031914
S  1.825864 -0.743338 1.346396
O  -0.868792 1.079106 1.178775
O  -0.637458 0.408242 -1.050583
C  -2.514933 -0.441681 0.323553
C  -3.274354 -0.872067 -0.948896
C  0.43414 1.784787 1.112319
C  1.48709 1.028042 1.92765
C  -1.262714 0.36221 0.032653
C  -4.47552 -1.782079 -0.618502
C  2.544536 -0.452781 -0.386618
C  3.968271 0.076555 -0.283902
H  -2.194756 -1.336469 0.89642
H  -3.160741 0.140293 1.006348
H  -3.620315 0.028297 -1.491608
H  -2.574877 -1.391618 -1.629022
H  0.727154 1.905698 0.054637
H  0.252816 2.776968 1.561937
H  1.148716 0.895742 2.969143
H  2.432186 1.599617 1.940045
H  -5.012996 -2.077723 -1.537428
H  -4.146943 -2.707366 -0.108369
H  -5.198657 -1.27098 0.044915
H  1.869225 0.21147 -0.948261
H  2.51997 -1.446285 -0.863039
H  4.031058 1.060155 0.205386
H  4.650093 -0.638972 0.197065
