program: Gaussian 09
title: 000233722
version: EM64L-G09RevD.01
frameworkgroup: C1[X(C21H22N2O2)]
method: RPBEPBE
basis: SDD
operation: Freq
keyword: #p
keyword: freq=noraman
keyword: PBEPBE/SDD
title: #p freq=noraman PBEPBE/SDD
converged: YES YES NO NO
title: Mulliken charges:
elementType: O O N N C C C C C C C C C C C C C C C C C C C C C H H H H H H H H H H H H H H H H H H H H H H
charge: -0.439779 -0.286144 -0.520348 -0.507733 -0.242140 0.499084 -0.523051 0.301395 0.064068 0.303625 -0.700274 -0.699054 -0.598074 0.144073 -0.858739 0.338790 0.433277 0.252573 -0.362411 -0.324799 -0.473769 -0.426956 -0.235923 -0.279487 -0.244382 0.255130 0.308099 0.220539 0.209212 0.223363 0.223755 0.209116 0.221142 0.216825 0.311530 0.247199 0.227653 0.226557 0.284089 0.309230 0.178664 0.237943 0.352467 0.239691 0.226935 0.226788 0.230254
chargesum: 0.00000
title: Mulliken charges with hydrogens summed into heavy atoms:
elementType: O O N N C C C C C C C C C C C C C C C C C C C C C
charge: -0.087311 -0.286144 -0.208819 -0.223645 0.012990 0.499084 -0.214952 0.301395 0.064068 0.303625 -0.047160 -0.045041 -0.381249 0.144073 -0.157330 0.338790 0.433277 0.252573 -0.053181 -0.146135 -0.235825 -0.187266 -0.008987 -0.052699 -0.014129
polarizability: 4.18904156e+02 -4.28568776e+00 2.95735424e+02 -3.83109573e-01 1.38997979e+00 1.20452396e+02
1716.lowfreq: -11.6300 -7.7525 -0.8014 -0.0007 0.0004 0.0006 5.3166 14.3024 26.6626
frequency: -7.9081 13.7993 26.6566 47.4364 51.3621 58.2947 81.3922 97.5955 105.3429 143.2813 174.7793 182.1938 185.5219 193.9701 210.6200 221.8027 243.0853 254.8573 259.6512 294.4377 305.3564 309.5861 318.0505 345.9500 398.3700 415.6877 416.4025 424.1963 436.5495 464.3419 470.4570 477.8487 498.7862 510.5634 526.0824 558.8897 567.5864 600.8832 608.5119 644.6720 658.6298 661.5304 696.1489 709.3446 732.2238 732.8950 739.2739 780.0718 781.0874 799.8064 803.5223 824.0294 839.7701 864.1046 881.7143 893.0222 922.2210 923.0234 943.4401 946.6795 956.6982 970.4787 984.1028 992.9386 993.7292 1024.6125 1038.7883 1038.9757 1063.2871 1092.2703 1103.3128 1115.0055 1137.1367 1150.3353 1155.3981 1182.0872 1182.6475 1196.3400 1204.1815 1216.6004 1236.7012 1269.2826 1278.7669 1288.9204 1314.4546 1324.2691 1348.8215 1357.9829 1377.7763 1386.9298 1394.9513 1397.5247 1407.7815 1416.8484 1421.1995 1443.3905 1456.0229 1461.8509 1465.4797 1469.9879 1479.3777 1480.0029 1486.3725 1489.5936 1497.0359 1529.1243 1545.6288 1591.4437 1598.7594 1604.7515 1628.0887 1633.3648 1655.1656 2948.0412 2973.2648 2976.3903 3015.0197 3029.9555 3067.0743 3075.0430 3075.5846 3082.4105 3085.0367 3097.6151 3101.7372 3125.4175 3130.1571 3141.7104 3154.3164 3162.7402 3183.7230 3197.0079 3535.1854 3553.6154 3584.2899
redmass: 4.4085 2.6523 6.1689 4.8881 5.8235 4.4576 3.1314 3.1366 4.4802 2.9358 4.0476 1.2542 5.0501 3.3840 1.1293 2.2070 1.1290 3.0707 3.3347 5.8071 4.3250 2.3033 1.2872 4.7529 2.3448 2.9779 2.9727 4.1294 2.7019 6.4918 3.3684 3.1897 4.1017 6.7729 6.1630 1.9681 3.3836 1.5772 6.6951 3.4959 5.7449 4.6921 11.1552 5.6924 4.7702 1.3530 3.4912 5.4527 2.1284 5.6359 1.3963 1.4776 4.1350 1.9196 3.1532 3.4501 1.2158 1.3262 1.4260 1.4088 1.3782 6.3691 1.3389 1.3530 1.5499 3.1145 1.4972 2.4814 2.3771 2.2002 1.9269 2.6731 1.8460 1.9266 1.4901 1.7395 1.1051 1.3605 1.9892 1.6351 1.8954 1.5393 1.4609 2.7543 5.2684 1.2881 1.7203 2.3513 1.1935 2.7399 1.3336 1.3968 2.5757 5.4951 3.5203 2.6785 2.3414 1.6583 1.0429 1.0519 1.0511 1.0450 1.1529 1.7990 1.6204 2.4881 2.6425 7.3211 5.3485 6.1484 6.8473 6.7034 3.2391 1.0402 1.0347 1.0351 1.0980 1.0856 1.1002 1.0992 1.1003 1.0988 1.0941 1.0865 1.0907 1.0869 1.0867 1.0935 1.0970 1.1003 1.0912 1.0940 1.0757 1.0746 1.0660
irintensity: 0.1216 0.1605 1.1428 0.0744 7.5051 1.1349 0.8762 0.2742 2.1491 2.5581 2.6687 0.0709 0.9235 0.3761 0.2436 0.0095 0.1302 2.4215 3.7634 0.0443 2.3216 51.4094 72.2021 15.0630 8.9187 10.5483 1.5759 8.6747 0.0910 20.2466 0.0809 12.8578 1.1037 0.4567 0.9560 11.7137 31.4649 101.8898 0.1454 3.0621 1.9232 7.7371 26.1783 0.6940 16.1143 23.6240 1.0153 9.6797 70.9549 2.4871 56.6121 23.6260 14.3439 24.0021 0.6904 11.5220 2.7423 5.9261 20.0671 0.4463 0.9118 1.1603 0.1983 5.8752 8.9154 29.3904 6.4054 11.9161 8.2284 18.6428 161.0391 3.6282 45.6029 92.0231 0.0159 228.1942 0.1547 45.4274 73.9363 126.0677 3.0428 71.7145 9.5838 110.1278 13.5446 0.3705 3.5858 48.1533 15.7257 183.7298 21.2848 42.8350 125.8015 322.2583 105.1678 9.9910 20.6591 201.7830 2.0270 3.9123 0.8037 14.3813 79.6495 370.7787 92.0645 745.9188 10.1261 31.4476 15.5692 28.3165 7.8647 18.5609 69.6150 40.8794 34.5642 33.7228 23.7733 0.0672 0.8625 92.4157 37.0075 45.1703 18.5945 32.0900 31.5919 0.7213 1.9164 31.6915 33.7701 31.0004 9.8958 8.8057 28.6467 21.9732 41.7116
temp: 298.150 k
press: 1.00000 atm
elementType: 8 8 7 7 6 6 6 6 6 6 6 6 6 6 6 6 6 6 6 6 6 6 6 6 6 1 1 1 1 1 1 1 1 1 1 1 1 1 1 1 1 1 1 1 1 1 1
symmnumber: 1
zpe: 999535.6 jmol-1
zpe.correction: 0.380703 hartree
zpe.thermalcorrener: 0.403633 hartree
zpe.thermalcorrenthalpy: 0.404577 hartree
zpe.thermalcorrgfe: 0.327430 hartree
zpe.sumelectzpe: -1071.640981 hartree
zpe.sumelectthermal: -1071.618052 hartree
zpe.sumelectthermalent: -1071.617108 hartree
zpe.sumelectthermalfe: -1071.694254 hartree
dipole: -0.8818 5.4461 -0.0572
dipole: 5.5174
quadrupole: -132.4225 -126.6302 -156.8011
quadrupole: 9.3279 -0.2514 0.1209
quadrupole: 6.1954 11.9878 -18.1832 9.3279 -0.2514 0.1209
hfenergy: -1072.0216845 hartree
pointgroup: C01 [X(C21H22N2O2)]
dipole: -0.2749247 2.1445404 0.1931658 debye
polarizability: 418.4790577|-8.3459123|294.1180801|-0.9820756|18.8866977|122.4948378 unknown
InChI: InChI=1S/C21H22N2O2/c1-13(2)17-12-19(14(3)11-20(17)24)23-21(25)22-18-10-6-8-15-7-4-5-9-16(15)18/h4-13,22-24H,1-3H3
charge 0 multiplicity 1
47 atoms
O  6.481405 0.701437 -0.017599
O  0.219261 -1.392843 -0.230642
N  0.818866 0.879912 -0.015624
N  -1.433998 0.290837 -0.067382
C  5.099436 -1.804692 -0.241256
C  4.362306 -0.46849 -0.129073
C  2.950213 -0.418897 -0.126856
C  2.245722 0.805725 -0.020587
C  5.067258 0.75642 -0.018472
C  2.963732 2.036424 0.087385
C  4.741625 -2.540906 -1.559742
C  4.810276 -2.706029 0.989541
C  4.373947 1.984283 0.086712
C  -3.89137 0.248459 -0.052215
C  2.246042 3.372054 0.199636
C  -2.63031 -0.469628 -0.149434
C  -5.125644 -0.508804 -0.145245
C  -0.102344 -0.174217 -0.114085
C  -2.626039 -1.864491 -0.321915
C  -3.988872 1.669565 0.131671
C  -5.082502 -1.929856 -0.322908
C  -6.379907 0.181967 -0.056238
C  -3.853468 -2.583069 -0.406204
C  -5.225791 2.315202 0.215411
C  -6.437634 1.564766 0.119422
H  6.181975 -1.585896 -0.255976
H  2.372398 -1.341198 -0.210848
H  3.666834 -2.797925 -1.596831
H  5.317849 -3.481398 -1.642239
H  4.972189 -1.915238 -2.440875
H  5.105728 -2.20455 1.928848
H  5.372207 -3.655723 0.912508
H  3.734293 -2.951827 1.058491
H  4.936974 2.924281 0.170102
H  0.445616 1.826397 0.069138
H  2.970528 4.199574 0.27359
H  1.610672 3.582591 -0.685203
H  1.603407 3.429188 1.10236
H  -1.568059 1.296613 0.034956
H  -1.670679 -2.385927 -0.389846
H  -3.092219 2.297393 0.217275
H  -6.023544 -2.487002 -0.390654
H  6.861684 1.611092 0.058226
H  -7.302628 -0.40595 -0.129444
H  -3.81454 -3.669475 -0.540632
H  -5.267396 3.400687 0.356582
H  -7.403199 2.077362 0.185568
