program: Gaussian 09
title: 000233702
version: EM64L-G09RevD.01
frameworkgroup: C1[X(C17H17NO5S)]
method: RPBEPBE
basis: SDD
operation: Freq
keyword: #p
keyword: freq=noraman
keyword: PBEPBE/SDD
title: #p freq=noraman PBEPBE/SDD
converged: YES YES NO NO
title: Mulliken charges:
elementType: S O O O O O N C C C C C C C C C C C C C C C C C H H H H H H H H H H H H H H H H H
charge: 0.867990 -0.530886 -0.532303 -0.450232 -0.209482 -0.276347 -0.419438 -0.133952 -0.069862 0.336249 0.044052 -0.264426 -0.244698 -0.042325 -0.361271 -0.357625 -0.397201 -0.250978 -0.251516 0.255923 -0.204709 -0.205739 -0.216752 -0.772734 0.277353 0.286061 0.288348 0.328943 0.267603 0.286935 0.234369 0.344721 0.281350 0.282398 0.242346 0.242662 0.238859 0.356530 0.254111 0.220275 0.255403
chargesum: 0.00000
title: Mulliken charges with hydrogens summed into heavy atoms:
elementType: S O O O O O N C C C C C C C C C C C C C C C C C
charge: 0.867990 -0.530886 -0.532303 -0.093702 -0.209482 -0.276347 -0.074718 0.143401 -0.069862 0.336249 0.044052 0.021635 0.043650 -0.042325 -0.032329 -0.090022 0.124102 0.030372 0.030881 0.255923 0.037636 0.036923 0.022107 -0.042944
polarizability: 3.02268398e+02 -1.86243040e+01 2.00948821e+02 -2.27866103e+00 1.04496072e+01 1.99877682e+02
1716.lowfreq: -11.8507 -3.0986 0.0011 0.0016 0.0017 2.7130 13.7120 17.6235 30.3590
frequency: 13.3923 17.5893 30.3359 37.2807 54.0884 55.0321 64.9728 78.3461 97.7660 99.1384 119.4318 132.1776 154.5638 161.9863 172.5962 200.1288 211.9650 239.0152 244.5566 270.2872 288.6024 308.8399 337.5597 361.4007 371.0570 387.0730 404.6001 410.8431 430.3832 441.1061 479.4290 514.9357 531.6385 560.7375 594.8292 602.5114 602.9560 622.5993 647.4752 657.7089 689.8076 693.2287 717.4178 739.5980 764.6864 786.5322 799.6531 851.9040 854.1195 862.1391 876.3249 924.5349 937.1807 942.0977 962.2945 974.2146 978.2788 981.0089 984.4641 997.4406 1003.6362 1005.8794 1008.4356 1008.6419 1037.1655 1043.5816 1046.6550 1059.9961 1075.7438 1118.0282 1127.3753 1173.3909 1175.6536 1186.5059 1192.8850 1194.1806 1242.2466 1263.6214 1298.9032 1301.9086 1323.0616 1332.2938 1370.2871 1375.6659 1383.6172 1388.8035 1389.7627 1435.9233 1450.1613 1452.5651 1456.2585 1469.3124 1472.6540 1485.8704 1567.6219 1577.1713 1586.9453 1589.6805 1605.5898 1609.2576 2929.9816 2999.2183 3026.3767 3098.5942 3104.5757 3105.7986 3137.4077 3145.1709 3146.5143 3149.4016 3154.6874 3161.3573 3163.7212 3167.6178 3174.4584 3467.0326 3574.5593
redmass: 5.8172 5.6147 4.4919 4.1401 4.4729 1.3515 3.5891 5.9566 4.2520 6.9000 7.0780 6.8678 6.8264 5.7334 5.5625 6.6206 4.1842 6.5812 7.9497 5.4270 5.8326 2.1826 2.2645 2.5215 6.6359 7.8900 2.8338 3.0029 4.1364 5.0563 5.2705 4.9301 4.5332 3.6257 4.2247 5.8704 4.1334 6.1065 4.4883 6.8332 1.2140 2.2835 4.8093 4.2156 1.5304 10.2705 4.9292 2.1223 1.3305 1.6365 1.3971 14.8848 1.3806 2.1785 4.1356 2.5541 3.5772 1.8056 1.3933 3.9509 1.4792 1.3647 2.3213 3.4685 1.8707 1.6776 2.1343 2.2070 1.5369 1.3855 1.8738 1.0569 1.1279 1.6840 1.1627 1.6273 2.1763 1.9766 1.2880 1.2839 1.7234 1.3449 3.7817 1.4286 7.8919 1.2529 2.9411 2.2627 1.0516 2.0388 1.4810 2.1199 1.4341 1.0964 10.3758 5.8279 7.1082 6.4427 6.9773 6.1241 1.0796 1.0359 1.0637 1.0977 1.1013 1.1024 1.0857 1.0897 1.0883 1.0882 1.0925 1.0968 1.0969 1.0977 1.1016 1.0771 1.0661
irintensity: 1.8512 1.0133 0.1537 0.1398 0.8811 0.2700 2.2062 7.3360 1.6341 1.7832 12.5449 3.8728 2.1096 14.3332 13.4916 2.4435 8.2713 2.8011 7.8840 3.8055 0.0542 62.3256 57.8330 39.0528 43.7189 0.8860 0.0378 2.6256 10.4913 3.1314 79.7123 128.8048 16.2979 28.7489 28.0754 1.8719 10.1330 3.6551 8.8291 14.3715 76.7750 39.3670 6.8832 4.1413 80.2432 73.8952 16.0417 1.7785 0.3799 34.5966 35.8965 70.1094 1.7577 82.5809 3.0793 29.1325 6.3715 8.2852 0.5607 1.5099 3.9813 0.1541 16.1984 4.6123 51.2492 7.2260 27.0464 12.5277 4.8021 5.0047 2.0012 0.0280 9.3208 16.3028 2.7182 20.8122 123.8616 20.3787 1.2641 12.2589 65.6393 34.1650 7.7759 35.1524 4.0666 79.0009 23.4121 17.0794 21.6952 17.6490 319.6307 1.4287 175.8610 17.5972 154.5082 4.6844 33.0554 25.7281 1.3729 91.5366 39.6401 8.6413 14.8321 6.6469 18.1063 21.8919 0.8810 15.2281 6.6198 2.8338 1.4706 4.9533 3.6368 2.6230 28.1967 95.6744 7.3083
temp: 298.150 k
press: 1.00000 atm
elementType: 16 8 8 8 8 8 7 6 6 6 6 6 6 6 6 6 6 6 6 6 6 6 6 6 1 1 1 1 1 1 1 1 1 1 1 1 1 1 1 1 1
symmnumber: 1
zpe: 807008.4 jmol-1
zpe.correction: 0.307373 hartree
zpe.thermalcorrener: 0.331297 hartree
zpe.thermalcorrenthalpy: 0.332241 hartree
zpe.thermalcorrgfe: 0.250042 hartree
zpe.sumelectzpe: -1485.030668 hartree
zpe.sumelectthermal: -1485.006744 hartree
zpe.sumelectthermalent: -1485.005800 hartree
zpe.sumelectthermalfe: -1485.087999 hartree
dipole: 2.6241 4.3542 -1.6487
dipole: 5.3444
quadrupole: -139.8325 -163.5885 -143.4300
quadrupole: -40.3340 7.0203 1.9855
quadrupole: 9.1179 -14.6382 5.5203 -40.3340 7.0203 1.9855
hfenergy: -1485.3380411 hartree
pointgroup: C01 [X(C17H17N1O5S1)]
dipole: -0.8532273 1.9167901 0.1382168 debye
polarizability: 303.5443301|6.4959132|192.6023845|-12.901359|-8.3823845|206.9481864 unknown
InChI: InChI=1S/C17H17NO5S/c1-12(20)18-16(11-19)17(21)13-7-9-15(10-8-13)24(22,23)14-5-3-2-4-6-14/h2-10,16,18-19H,11H2,1H3
charge 0 multiplicity 1
41 atoms
S  3.280722 -1.667519 0.060946
O  3.424907 -2.504439 -1.339244
O  3.795115 -2.22562 1.512628
O  -3.550179 -0.537132 -2.07148
O  -3.360022 -1.204249 1.700906
O  -5.364282 2.744678 -0.100475
N  -4.908318 0.553464 0.51571
C  -3.492271 0.646988 0.136446
C  1.430186 -1.276942 0.268004
C  -1.285994 -0.761142 0.578722
C  -2.747386 -0.518947 0.830797
C  0.62097 -1.26925 -0.877194
C  0.939108 -1.094448 1.570109
C  4.120419 0.014722 -0.213031
C  -0.755764 -0.995837 -0.719078
C  -0.440764 -0.84659 1.719645
C  -3.309621 0.743657 -1.398398
C  4.592299 0.70498 0.914133
C  4.289704 0.454729 -1.534814
C  -5.750246 1.653236 0.42435
C  5.248719 1.939073 0.696097
C  4.948715 1.690904 -1.732039
C  5.418858 2.430196 -0.620417
C  -7.15604 1.459354 0.979373
H  -3.064258 1.590146 0.549935
H  1.047681 -1.507467 -1.857062
H  1.609888 -1.183139 2.430917
H  -1.425467 -1.037921 -1.583714
H  -0.874508 -0.725202 2.71743
H  -3.980396 1.540275 -1.767682
H  -2.272193 1.016398 -1.644677
H  -5.146373 -0.246512 1.115041
H  4.476201 0.277516 1.915692
H  3.946136 -0.161487 -2.37241
H  5.632738 2.507439 1.54952
H  5.101557 2.068109 -2.748483
H  5.931262 3.384915 -0.781188
H  -4.501936 -0.785615 -1.960263
H  -7.891613 1.634906 0.175536
H  -7.324379 0.455779 1.4054
H  -7.342077 2.217198 1.759812
