program: Gaussian 09
title: 000233653
version: EM64L-G09RevD.01
frameworkgroup: C1[X(C9H19NO)]
method: RPBEPBE
basis: SDD
operation: Freq
keyword: #p
keyword: freq=noraman
keyword: PBEPBE/SDD
title: #p freq=noraman PBEPBE/SDD
converged: YES YES NO NO
title: Mulliken charges:
elementType: O N C C C C C C C C C H H H H H H H H H H H H H H H H H H H
charge: -0.276291 -0.364574 -0.033361 -0.538554 -0.331665 -0.370583 0.233782 -0.340448 -0.694208 -0.704512 -0.691750 0.200904 0.198932 0.232309 0.176088 0.213262 0.207890 0.250185 0.204610 0.190206 0.197710 0.205876 0.260441 0.215428 0.199510 0.229112 0.289636 0.207871 0.217622 0.214572
chargesum: 0.00000
title: Mulliken charges with hydrogens summed into heavy atoms:
elementType: O N C C C C C C C C C
charge: -0.276291 -0.074938 0.167543 -0.107313 0.057685 0.087493 0.233782 0.054368 -0.030182 -0.060463 -0.051684
polarizability: 1.31691408e+02 1.29296819e-01 9.53225251e+01 4.36113267e+00 -1.32622582e+00 9.82729731e+01
1716.lowfreq: -0.0010 -0.0006 0.0000 3.9900 8.1324 13.7195 25.2189 36.8920 48.5555
frequency: 23.7206 36.7961 48.3892 67.1273 104.6683 106.8165 158.4983 217.6554 220.3580 232.7356 251.6461 265.3680 287.4864 354.5584 366.5666 411.8281 456.1376 484.8875 559.7868 595.9758 723.5072 739.1030 784.5373 793.7145 864.5458 894.3007 900.5697 921.7999 948.0431 961.5749 967.7659 1004.9239 1056.3188 1077.2710 1102.2502 1110.0738 1115.6000 1152.6420 1187.3809 1205.9390 1222.5107 1250.4642 1271.4902 1278.0254 1289.1898 1295.7946 1328.3880 1345.6649 1352.3099 1366.3413 1379.6592 1389.5343 1399.3315 1454.8343 1457.9870 1464.6327 1467.6742 1470.9895 1476.9157 1477.4753 1482.4355 1486.0263 1489.6727 1491.3147 1610.1515 2959.5351 2963.6684 2968.5873 2969.8713 2974.7196 2977.5893 2981.7111 2984.3575 3009.2565 3036.0102 3048.5940 3061.5265 3068.5980 3069.5610 3072.0579 3073.7673 3074.4496 3094.4147 3551.5086
redmass: 2.7318 5.2524 3.0028 1.7487 2.5765 2.4198 3.2123 1.3479 1.6906 1.1921 1.1142 3.4013 3.3112 2.1827 2.2774 2.7140 2.8360 2.3163 1.3656 3.0022 2.0021 1.3146 2.4034 1.6598 2.1106 1.6397 1.7340 1.2500 1.5085 1.5688 1.7684 3.7144 2.3733 2.4284 1.4985 2.0598 2.3348 1.8271 1.9889 1.7240 1.3756 1.3706 1.3711 1.5293 1.1332 1.1143 1.4952 1.3805 1.4336 1.3988 1.2173 1.2147 1.2141 1.1458 1.0986 1.0471 1.0906 1.0696 1.0833 1.0485 1.1187 1.1983 1.2111 1.1505 5.8060 1.0789 1.0597 1.0373 1.0601 1.0361 1.0415 1.0666 1.0614 1.0959 1.0999 1.0996 1.0993 1.0994 1.0996 1.0992 1.0998 1.1002 1.0991 1.0775
irintensity: 0.7065 7.3625 0.5648 0.1872 0.2754 1.3647 4.0026 1.0048 0.6404 0.3314 0.1211 1.1786 7.5228 1.6713 1.9809 0.6673 2.3515 18.7467 100.2406 5.1111 4.5148 10.8751 0.4431 2.0189 0.9314 1.5089 7.0576 5.3378 3.6853 0.1052 0.0199 3.5312 6.8888 1.6191 8.2833 1.5165 14.1610 12.6938 11.2099 46.7862 27.2471 7.0493 5.3693 53.0063 12.5291 19.0511 2.1104 0.9696 5.4444 1.7708 25.7382 9.9555 21.5634 25.1852 10.1310 4.2440 4.2690 3.7130 22.6785 10.1892 38.2716 40.7040 53.9927 84.3960 145.4343 21.6144 5.2198 22.9423 55.5995 37.5494 59.5440 64.8609 36.3733 6.6424 32.8494 13.4636 40.8156 34.7704 10.3058 65.5106 67.8351 62.5505 27.9074 12.0873
temp: 298.150 k
press: 1.00000 atm
elementType: 8 7 6 6 6 6 6 6 6 6 6 1 1 1 1 1 1 1 1 1 1 1 1 1 1 1 1 1 1 1
symmnumber: 1
zpe: 704011.1 jmol-1
zpe.correction: 0.268144 hartree
zpe.thermalcorrener: 0.282376 hartree
zpe.thermalcorrenthalpy: 0.283320 hartree
zpe.thermalcorrgfe: 0.225537 hartree
zpe.sumelectzpe: -483.432931 hartree
zpe.sumelectthermal: -483.418699 hartree
zpe.sumelectthermalent: -483.417755 hartree
zpe.sumelectthermalfe: -483.475538 hartree
dipole: -0.9629 0.8970 -3.6047
dipole: 3.8374
quadrupole: -65.3385 -72.3976 -70.8446
quadrupole: 2.1395 -3.0847 4.1902
quadrupole: 4.1884 -2.8707 -1.3177 2.1395 -3.0847 4.1902
hfenergy: -483.7010743 hartree
pointgroup: C01 [X(C9H19N1O1)]
dipole: 0.3130536 -0.2914706 -1.4478776 debye
polarizability: 131.1974661|0.656353|95.2262809|-5.9156965|1.1361458|98.8631592 unknown
InChI: InChI=1S/C9H19NO/c1-4-5-6-10-9(11)7-8(2)3/h8,10H,4-7H2,1-3H3
charge 0 multiplicity 1
30 atoms
O  -0.805874 1.071697 1.326079
N  0.13088 0.889987 -0.795804
C  -2.971248 -0.70929 -0.207767
C  -2.318589 0.66308 -0.577228
C  2.352962 -0.229977 -0.377451
C  1.518493 1.07164 -0.34004
C  -0.951615 0.891593 0.075341
C  3.807736 0.001605 0.091184
C  -3.396064 -0.769631 1.278192
C  -2.05206 -1.897411 -0.578797
C  4.659037 -1.28563 0.053449
H  -3.889205 -0.782554 -0.828831
H  -2.238096 0.739119 -1.68013
H  -2.987054 1.475416 -0.234917
H  2.360268 -0.643464 -1.407835
H  1.865915 -0.986542 0.268322
H  2.00875 1.849463 -0.959337
H  1.454555 1.448411 0.696143
H  3.79653 0.409806 1.121911
H  4.280211 0.776988 -0.546591
H  -3.864719 -1.745117 1.507446
H  -4.125809 0.02664 1.516038
H  -2.52451 -0.626889 1.939345
H  -2.570085 -2.857946 -0.402038
H  -1.751452 -1.865924 -1.643916
H  -1.133281 -1.893641 0.037073
H  -0.038357 0.708283 -1.786243
H  4.714751 -1.695488 -0.972726
H  5.692107 -1.09632 0.398108
H  4.223526 -2.067204 0.703723
